program: Gaussian 09
title: 000271824
version: EM64L-G09RevD.01
frameworkgroup: C1[X(C6H12O2S)]
method: RPBEPBE
basis: SDD
operation: Freq
keyword: #p
keyword: freq=noraman
keyword: PBEPBE/SDD
title: #p freq=noraman PBEPBE/SDD
converged: YES YES NO NO
title: Mulliken charges:
elementType: S O O C C C C C C H H H H H H H H H H H H
charge: -0.037778 -0.267592 -0.252131 -0.352489 -0.459587 -0.706347 0.259807 -0.262774 -0.664302 0.244161 0.218282 0.253477 0.240293 0.262549 0.274511 0.233306 0.222736 0.216805 0.227858 0.249133 0.100080
chargesum: 0.00000
title: Mulliken charges with hydrogens summed into heavy atoms:
elementType: S O O C C C C C C
charge: 0.062302 -0.267592 -0.252131 0.109955 0.034182 -0.169287 0.259807 0.193269 0.029494
polarizability: 1.05503464e+02 -2.50857073e+00 7.88889541e+01 -2.32935268e+00 1.01152590e-01 7.80108695e+01
1716.lowfreq: -4.8081 -0.0026 0.0008 0.0019 4.3837 11.8779 28.5173 41.8526 67.3718
frequency: 27.5829 41.5512 67.3641 112.0534 121.1024 163.0537 212.9589 238.5578 252.2182 306.9924 352.4107 409.5115 454.5863 568.3639 603.7057 665.2943 761.9486 778.9662 788.4614 815.5447 876.1068 917.3126 990.2875 1014.6882 1065.4422 1084.9820 1095.2384 1128.7544 1155.7625 1168.4381 1196.0703 1265.0596 1278.5600 1295.8984 1306.0125 1353.1445 1369.7903 1389.5263 1443.5961 1448.1029 1456.3816 1463.1585 1468.1299 1484.6765 1638.0541 2435.9270 2972.7234 2985.3005 2993.0032 3027.7984 3028.8354 3045.2030 3067.3947 3088.1360 3092.6844 3101.0213 3118.8812
redmass: 4.1428 4.1711 3.4574 3.5229 3.5544 2.0704 1.2914 1.6943 1.3793 2.6683 3.4902 3.1882 3.3511 3.1888 3.6022 3.8167 1.3246 1.3803 1.8156 1.7087 1.8021 2.4251 2.2502 2.8527 2.0316 2.2190 2.1866 2.4626 1.6783 1.3556 1.2872 1.1902 1.1172 1.2207 1.3333 1.2905 1.6400 1.2352 1.0823 1.0879 1.0933 1.0431 1.0863 1.0512 8.9147 1.0382 1.0656 1.0628 1.0360 1.0623 1.0596 1.0919 1.0967 1.0974 1.1031 1.1066 1.1059
irintensity: 2.1052 0.2571 1.2176 1.5123 3.4060 5.4457 14.0723 1.8662 21.2750 12.6761 3.8531 7.9958 1.6608 2.9134 5.4172 6.0424 4.1923 22.0834 11.3412 2.6576 2.3073 26.3847 2.0130 59.4440 41.8454 5.0029 37.4248 204.6446 17.7025 39.7347 42.7069 5.2255 3.1278 40.7868 49.2456 0.9642 32.2426 22.5073 18.7262 5.7117 12.8025 14.9439 23.0289 12.5197 152.6078 25.3141 20.6526 23.8410 18.7281 23.4614 31.7328 8.0880 23.3450 36.1847 0.6199 17.0759 34.4516
temp: 298.150 k
press: 1.00000 atm
elementType: 16 8 8 6 6 6 6 6 6 1 1 1 1 1 1 1 1 1 1 1 1
symmnumber: 1
zpe: 448912.5 jmol-1
zpe.correction: 0.170982 hartree
zpe.thermalcorrener: 0.182479 hartree
zpe.thermalcorrenthalpy: 0.183424 hartree
zpe.thermalcorrgfe: 0.131735 hartree
zpe.sumelectzpe: -783.605895 hartree
zpe.sumelectthermal: -783.594397 hartree
zpe.sumelectthermalent: -783.593453 hartree
zpe.sumelectthermalfe: -783.645141 hartree
dipole: 1.0269 -0.8774 -0.6635
dipole: 1.5049
quadrupole: -57.7715 -62.7723 -64.9891
quadrupole: 6.4050 -4.2585 3.6574
quadrupole: 4.0728 -0.9280 -3.1448 6.4050 -4.2585 3.6574
hfenergy: -783.7768768 hartree
pointgroup: C01 [X(C6H12O2S1)]
dipole: -0.3668827 0.323307 -0.3337826 debye
dipolederiv: -0.3819131 0.028511 -0.0417941 0.0689501 -0.1674264 0.1221708 -0.0686748 0.2133237 0.0299613 -1.5293019 -0.1872127 -0.2517776 -0.1581986 -0.375508 -0.0890899 -0.3923696 -0.1127051 -0.6049586 -0.7169999 0.0635923 0.1061766 -0.0793208 -0.4482632 -0.2488269 -0.1659967 -0.2770662 -0.7772233 0.037943 0.0034813 0.0108986 0.1484935 -0.0130708 0.0009634 0.0795748 -0.0099846 0.0392716 -0.4294167 0.0613834 0.0469527 0.245381 -0.0312418 -0.0904299 0.0546172 -0.1039392 0.0556591 0.1553225 -0.1126075 0.0314682 -0.1827618 0.3556761 -0.078464 0.033408 -0.2023189 0.1617818 1.7071238 -0.0018486 0.1455238 0.1306341 0.4254137 0.4156189 0.5415927 0.474165 1.0144599 0.8274656 0.0834544 0.027101 -0.0158597 0.2985827 -0.0784029 -0.1462395 -0.0437045 0.2785997 -0.0922554 -0.0469901 0.0092319 -0.0276555 -0.0567319 0.1156878 0.0652594 0.0818944 -0.0255821 0.0813786 0.006419 0.0046172 -0.0307203 0.0974832 0.0068437 -0.0181506 -0.0211666 -0.1000969 0.0051685 0.0779229 -0.0301256 -0.0017147 -0.1444281 0.0683957 -0.0078281 0.0812097 0.0729014 0.162169 -0.0017032 0.0333032 -0.1014022 -0.0189919 0.0194541 0.0478851 0.0406086 0.0850336 0.051108 -0.0072858 -0.0006581 -0.0465169 0.1032413 0.0165801 -0.0176938 -0.0048703 -0.0963268 0.0893864 0.0297557 -0.0050107 0.0533594 0.0350726 0.0004676 0.0519031 0.0060424 -0.1060241 -0.0913355 -0.0519034 -0.0317888 -0.0671471 -0.1071283 0.0099023 -0.0685617 -0.0123158 0.063498 0.0078007 -0.0447039 -0.0048973 0.0354364 -0.084558 -0.0363301 0.0884866 -0.0810468 0.0545982 -0.0554712 0.0029519 -0.0655301 0.0017915 0.083672 0.0339506 -0.085532 0.0672167 -0.0925576 -0.1754192 0.0223494 0.0576321 0.0155916 0.0832246 -0.004763 0.0790676 0.0082864 0.1072366 0.1205175 0.0280336 0.0239445 -0.0125278 -0.0942519 -0.0701858 0.0086312 -0.1074712 0.0215307 0.066231 0.0200144 -0.1147559 -0.0056402 0.0770485 0.0089075 -0.0896169 0.0358404 -0.0515552 0.1604981 0.0263859 0.0494881 0.0298281 -0.0178143 -0.12245 0.0102379 -0.0319984 -0.1302072 unknown
polarizability: 104.7459122|-4.3389916|79.3895426|3.5271249|-0.6354886|78.267833 unknown
InChI: InChI=1S/C6H12O2S/c1-2-8-6(7)4-3-5-9/h9H,2-5H2,1H3
charge 0 multiplicity 1
21 atoms
S  3.61612 -1.521015 0.33789
O  -1.65911 -0.066435 -0.906419
O  -0.86806 0.829025 1.099431
C  1.853754 0.747772 0.035179
C  0.713738 -0.102182 -0.560193
C  3.252098 0.223957 -0.329831
C  -0.646125 0.284639 -0.008232
C  -3.065777 0.181843 -0.458673
C  -3.583595 -0.991201 0.378255
H  1.734553 0.796778 1.133535
H  1.767821 1.79062 -0.332376
H  0.890932 -1.168786 -0.307247
H  0.686639 -0.043334 -1.66273
H  3.378294 0.116908 -1.421161
H  4.040556 0.896399 0.045698
H  -3.089603 1.12546 0.114549
H  -3.621307 0.294218 -1.403397
H  -4.648459 -0.829831 0.629555
H  -3.500616 -1.939969 -0.179546
H  -3.017813 -1.078781 1.320921
H  3.546461 -1.176188 1.678693
