program: Gaussian 09
title: 000271831
version: EM64L-G09RevD.01
frameworkgroup: C1[X(C10H14N2O6)]
method: RPBEPBE
basis: SDD
operation: Freq
keyword: #p
keyword: freq=noraman
keyword: PBEPBE/SDD
title: #p freq=noraman PBEPBE/SDD
converged: YES YES NO NO
title: Mulliken charges:
elementType: O O O O O O N N C C C C C C C C C C H H H H H H H H H H H H H H
charge: -0.283607 -0.218210 -0.439575 -0.421548 -0.226406 -0.227550 -0.226055 -0.250017 -0.104181 -0.144783 -0.167526 -0.095479 -0.106702 -0.145166 0.236921 0.213362 -0.617652 -0.623744 0.296774 0.281540 0.280213 0.268392 0.226950 0.290201 0.363179 0.355854 0.239519 0.224745 0.275387 0.230233 0.277732 0.237198
chargesum: 0.00000
title: Mulliken charges with hydrogens summed into heavy atoms:
elementType: O O O O O O N N C C C C C C C C C C
charge: -0.283607 -0.218210 -0.076396 -0.065695 -0.226406 -0.227550 -0.226055 -0.250017 0.192593 0.136758 0.112687 0.172914 0.120248 0.145036 0.236921 0.213362 0.121998 0.121419
polarizability: 1.54868426e+02 2.88917029e+00 1.30999798e+02 8.60730493e+00 -4.41543547e-01 1.08136820e+02
1716.lowfreq: -4.9486 0.0007 0.0008 0.0010 10.8022 16.6787 43.2646 61.6753 64.7804
frequency: 43.0843 61.6349 64.7749 107.7453 114.8536 126.1765 132.7183 146.5634 155.1051 197.7078 218.0406 228.6701 253.2227 266.2533 283.3545 320.1521 366.1351 386.4475 409.2165 426.3815 438.9990 473.0704 520.0852 542.3374 580.3553 628.6314 640.9938 657.4183 680.3319 680.8820 755.4721 758.0436 795.2437 805.7385 862.5227 875.9722 900.2910 948.2519 972.4458 981.4662 1002.1232 1019.8887 1032.5115 1064.6675 1069.9973 1072.0924 1114.6344 1129.4717 1130.3687 1136.4232 1173.6697 1210.9720 1215.4959 1226.0101 1250.6714 1256.6681 1265.1151 1266.4647 1288.7645 1298.6591 1311.1863 1323.9141 1354.1043 1359.0467 1363.3598 1370.8232 1379.2678 1387.3826 1430.6574 1433.1800 1476.8480 1477.2376 1491.3371 1492.4097 1711.2731 1721.8261 2952.1942 2970.9131 2975.7182 2993.5414 3022.8577 3043.6552 3050.9040 3053.5106 3060.1754 3095.6262 3103.6955 3105.8586 3520.8928 3527.6305
redmass: 4.7686 5.7449 5.9732 2.0439 1.9673 2.9279 2.0808 1.9515 2.8888 8.0824 4.8279 6.9522 5.0364 3.4793 4.0136 5.3406 5.2471 3.9838 4.1127 1.2386 1.2343 4.8915 5.5092 4.9421 5.5358 5.6548 7.2708 6.1637 11.4896 11.4705 5.3102 6.1725 5.0957 5.6534 4.4241 5.2912 2.7009 3.9586 4.3985 6.5055 3.5984 3.7783 3.1126 2.3882 2.0854 1.9184 2.7404 1.3048 1.4138 2.1902 1.1871 1.5957 1.3158 1.7389 1.7648 1.4851 2.3296 2.8782 1.6416 1.4603 1.2861 1.5114 1.5347 1.6483 1.6779 1.4519 1.7859 1.8123 1.1631 1.1641 1.0455 1.0489 1.0839 1.0789 11.1103 11.1673 1.0830 1.0361 1.0352 1.0855 1.0863 1.0867 1.1017 1.1022 1.0880 1.0858 1.0985 1.0986 1.0653 1.0658
irintensity: 3.5596 2.0226 3.6215 1.0027 0.7068 0.6856 1.8164 0.6968 8.3815 0.9402 1.7302 2.0290 10.6495 0.9751 13.0869 4.4623 2.0823 10.1528 17.0635 73.6013 221.6749 8.8148 7.6696 7.7875 4.0233 15.7463 10.4902 20.4250 17.9242 22.3427 6.6508 5.4283 11.3495 14.0405 24.0057 8.1854 19.7093 43.7323 136.5007 167.4639 27.6616 2.3036 42.0265 36.3871 190.3011 18.1279 26.2493 0.4861 4.0072 1.8957 21.0333 89.7155 52.9310 11.4592 21.9549 36.1157 10.6618 22.1124 1.4329 12.3835 9.9944 13.1442 12.3478 27.9230 113.4548 0.9845 26.2858 7.7218 52.6766 45.9144 21.6047 17.9053 6.0613 8.2401 691.3660 359.9790 29.2335 48.6386 64.4192 27.2465 10.1197 17.9782 30.1912 33.4449 22.2787 3.5087 1.4645 1.8351 14.4437 16.8691
temp: 298.150 k
press: 1.00000 atm
elementType: 8 8 8 8 8 8 7 7 6 6 6 6 6 6 6 6 6 6 1 1 1 1 1 1 1 1 1 1 1 1 1 1
symmnumber: 1
zpe: 649527.3 jmol-1
zpe.correction: 0.247392 hartree
zpe.thermalcorrener: 0.264326 hartree
zpe.thermalcorrenthalpy: 0.265270 hartree
zpe.thermalcorrgfe: 0.202981 hartree
zpe.sumelectzpe: -948.933404 hartree
zpe.sumelectthermal: -948.916470 hartree
zpe.sumelectthermalent: -948.915525 hartree
zpe.sumelectthermalfe: -948.977815 hartree
dipole: -2.6991 -6.3695 1.7657
dipole: 7.1396
quadrupole: -134.3626 -102.6138 -108.6887
quadrupole: -5.9719 -11.9087 -0.7627
quadrupole: -19.1409 12.6079 6.5330 -5.9719 -11.9087 -0.7627
hfenergy: -949.1807959 hartree
pointgroup: C01 [X(C10H14N2O6)]
dipole: -1.0835625 2.4940311 -0.7041216 debye
polarizability: 155.0209588|-2.6523179|130.9416867|-8.3333894|-0.5748871|108.0423986 unknown
InChI: InChI=1S/C10H14N2O6/c1-11-3-5(13)4-8(18-10(16)12(4)2)6(14)7(3)17-9(11)15/h3-8,13-14H,1-2H3
charge 0 multiplicity 1
32 atoms
O  -2.034037 -1.230397 0.557935
O  2.327708 -1.223416 0.273148
O  0.785253 0.770529 -2.092421
O  -0.061828 -3.160237 -0.24459
O  -3.567953 0.121792 1.724842
O  4.278421 0.077367 0.438526
N  -2.40809 0.888221 -0.2029
N  2.110028 1.047262 0.446657
C  -1.362529 0.39324 -1.11313
C  0.711425 0.594472 0.392104
C  -1.330911 -1.126997 -0.768576
C  0.871133 -0.964923 0.46406
C  0.003117 1.089257 -0.897615
C  0.061901 -1.74766 -0.589846
C  -2.769584 -0.025517 0.783035
C  3.03823 -0.004273 0.40243
C  -3.054609 2.194857 -0.331675
C  2.506481 2.417084 0.784321
H  -1.640417 0.548044 -2.171546
H  0.138176 0.959674 1.266479
H  -1.914312 -1.723423 -1.489385
H  0.610375 -1.328502 1.47309
H  -0.151975 2.187443 -0.823912
H  0.596573 -1.725999 -1.55214
H  1.739175 0.98132 -1.911573
H  -0.659479 -3.23945 0.545374
H  -3.554452 2.293614 -1.3134
H  -2.33241 3.024398 -0.216725
H  -3.811658 2.276146 0.465315
H  2.140754 3.14353 0.035786
H  3.608131 2.452414 0.801693
H  2.123867 2.709531 1.781137
