program: Gaussian 09
title: 000271835
version: EM64L-G09RevD.01
frameworkgroup: C1[X(C15H17N)]
method: RPBEPBE
basis: SDD
operation: Freq
keyword: #pfreq=noraman
keyword: PBEPBE/SDD
title: #p freq=noraman PBEPBE/SDD
converged: YES YES NO NO
title: Mulliken charges:
elementType: N C C C C C C C C C C C C C C C H H H H H H H H H H H H H H H H H
charge: -0.049328 0.221671 0.196285 0.137968 0.303360 0.346044 -0.660779 -0.402137 -0.371717 -0.020724 -0.861228 -0.854729 -0.265887 -0.270914 -0.820431 -0.690474 0.261092 0.246067 0.248188 0.255404 0.236881 0.234933 0.229792 0.239767 0.232210 0.225315 0.225849 0.232337 0.241659 0.267597 0.241232 0.209419 0.235277
chargesum: 0.00000
title: Mulliken charges with hydrogens summed into heavy atoms:
elementType: N C C C C C C C C C C C C C C C
charge: -0.049328 0.221671 0.196285 0.137968 0.303360 0.346044 -0.399687 -0.156070 -0.123529 -0.020724 -0.134010 -0.152959 -0.040571 -0.045064 -0.078838 -0.004546
polarizability: 2.30981732e+02 9.89357629e+00 2.14710486e+02 -4.66679305e+00 4.72416007e-02 9.38401217e+01
1716.lowfreq: -3.4269 -0.0001 0.0005 0.0007 7.8293 11.6761 51.0992 70.3880 84.4695
frequency: 51.0887 70.3595 84.4509 110.3806 115.5169 137.3855 160.1490 176.0961 198.6604 224.3221 247.4016 259.3637 295.1578 304.0452 337.4639 344.4272 386.5404 440.1575 442.5246 474.7138 510.1534 511.2212 579.3844 610.1034 630.3671 642.2735 660.8847 694.1136 754.3876 770.2383 792.0798 864.0549 874.5491 880.5512 907.4776 958.5439 977.3918 987.8157 997.4624 1017.7667 1023.9656 1033.2029 1037.4928 1051.2436 1065.9052 1084.8303 1086.2037 1107.8501 1169.3020 1177.0224 1181.8657 1243.9430 1268.3440 1301.4987 1370.3324 1376.8379 1381.0501 1396.2511 1401.5571 1407.2527 1408.6116 1427.4880 1451.6454 1452.6934 1457.6566 1468.5435 1469.5137 1477.6993 1485.1504 1491.7774 1493.0494 1519.7096 1582.6350 1592.4546 1615.9768 1623.2422 2938.7294 2974.3892 2975.0709 2978.5768 3029.2746 3043.1343 3048.9376 3050.9528 3055.3625 3084.5938 3108.8975 3114.6499 3125.2244 3140.5790 3142.2488 3157.0360 3167.0886
redmass: 2.8311 2.8090 1.1738 2.7510 2.8205 1.9090 1.2998 1.0632 1.2212 3.6786 4.0011 3.2239 3.3231 3.1161 2.9045 3.2523 3.3730 5.0324 3.5077 4.8942 3.2967 3.4158 3.7207 3.9898 3.5208 3.2199 3.1782 4.8608 4.6402 1.3960 2.7677 3.8441 1.6452 2.8064 1.4448 1.3697 2.2674 1.3303 1.5571 1.5984 1.4541 2.5662 2.8580 1.6530 2.2852 1.5154 2.1041 1.5725 1.9607 1.7223 1.3584 1.6351 1.8210 3.0890 4.7430 1.2345 1.9744 1.5081 1.2385 1.7262 1.9676 3.4107 1.7283 1.1740 1.0634 1.0594 1.3541 1.0711 1.0535 1.0641 1.0662 3.4415 6.4596 6.3722 7.5540 6.5400 1.0364 1.0399 1.0385 1.0387 1.0955 1.0969 1.0976 1.0974 1.0972 1.0980 1.0944 1.0976 1.0850 1.0889 1.0911 1.0940 1.0994
irintensity: 0.3093 1.2826 1.6481 2.8062 3.9320 1.7818 0.1844 1.0583 0.2781 2.0017 0.4457 2.2825 2.9898 1.7773 2.2840 2.7563 3.2185 0.6631 3.4513 1.1119 0.0783 3.0711 3.1801 0.9692 6.1743 2.6221 0.3065 1.2051 0.9277 80.3786 1.5299 3.1240 0.1460 2.5730 14.8702 1.3993 9.3879 0.1944 10.0238 1.6236 7.6190 8.9893 6.9166 1.1760 0.9646 4.9630 0.8595 12.5631 5.5602 4.8206 3.1882 3.5510 15.6067 29.2231 24.5286 25.0958 11.2076 5.6189 13.7248 2.6932 5.8927 1.6352 0.3220 4.4947 16.2240 23.5860 5.2036 30.9167 9.4138 6.6362 7.1412 13.6908 17.8657 24.8126 55.9237 3.1482 102.6497 23.5264 49.9042 14.4058 35.1399 20.1147 22.2258 19.0313 14.3571 19.2084 20.3756 16.5547 2.3653 9.2280 7.9134 32.9074 27.3262
temp: 298.150 k
press: 1.00000 atm
elementType: 7 6 6 6 6 6 6 6 6 6 6 6 6 6 6 6 1 1 1 1 1 1 1 1 1 1 1 1 1 1 1 1 1
symmnumber: 1
zpe: 722541.9 jmol-1
zpe.correction: 0.275202 hartree
zpe.thermalcorrener: 0.290904 hartree
zpe.thermalcorrenthalpy: 0.291849 hartree
zpe.thermalcorrgfe: 0.232870 hartree
zpe.sumelectzpe: -635.391192 hartree
zpe.sumelectthermal: -635.375490 hartree
zpe.sumelectthermalent: -635.374545 hartree
zpe.sumelectthermalfe: -635.433524 hartree
dipole: -0.0072 -0.3599 1.3618
dipole: 1.4086
quadrupole: -79.6350 -87.0430 -100.9876
quadrupole: -4.1152 3.3229 1.8333
quadrupole: 9.5868 2.1789 -11.7657 -4.1152 3.3229 1.8333
hfenergy: -635.6663941 hartree
pointgroup: C01 [X(C15H17N1)]
dipole: 0.0049035 -0.0479515 0.5520938 debye
polarizability: 229.8587322|9.7627392|212.2039193|-6.4349326|-20.7259573|97.4696877 unknown
InChI: InChI=1S/C15H17N/c1-10-9-15(12(3)16-4)14-8-6-5-7-13(14)11(10)2/h5-9H,1-4H3
charge 0 multiplicity 1
33 atoms
N  3.099088 0.81054 -0.722571
C  -1.509318 -0.394832 0.110329
C  -0.090443 -0.704752 0.145517
C  -1.963337 0.967024 -0.07262
C  0.861004 0.375059 0.023754
C  -1.011513 1.992251 -0.247309
C  0.381595 1.672348 -0.193123
C  -2.445796 -1.478095 0.233856
C  0.311167 -2.080608 0.237951
C  2.348405 0.192831 0.157121
C  -3.454269 1.263036 -0.091778
C  -1.408486 3.443322 -0.479263
C  -2.021711 -2.80295 0.354823
C  -0.626975 -3.109238 0.342364
C  2.874195 -0.585465 1.372682
C  4.569529 0.776642 -0.63077
H  1.118431 2.472945 -0.31799
H  -3.518383 -1.261708 0.219531
H  1.37581 -2.328781 0.194429
H  -3.65634 2.337087 -0.217435
H  -3.962174 0.731108 -0.919388
H  -3.942771 0.940347 0.847506
H  -1.97981 3.858541 0.372752
H  -0.514164 4.073616 -0.617639
H  -2.038482 3.558318 -1.381204
H  -2.756655 -3.61086 0.443004
H  -0.296251 -4.151987 0.403844
H  3.4984 -1.450351 1.076934
H  3.509144 0.074962 1.993494
H  2.04958 -0.950748 2.002401
H  4.967796 0.431457 -1.603284
H  5.005069 0.143639 0.170644
H  4.934767 1.812902 -0.491663
