program: Gaussian 09
title: 000271850
version: EM64L-G09RevD.01
frameworkgroup: C1[X(C16H20Cl2N2O2)]
method: RPBEPBE
basis: SDD
operation: Freq
keyword: #p
keyword: freq=noraman
keyword: PBEPBE/SDD
title: #p freq=noraman PBEPBE/SDD
converged: YES YES NO NO
title: Mulliken charges:
elementType: Cl Cl O O N N C C C C C C C C C C C C C C C C H H H H H H H H H H H H H H H H H H H H
charge: -0.068665 -0.069233 -0.265065 -0.255332 -0.193443 -0.409881 0.108965 0.483206 0.236904 0.293906 -0.573457 -0.390029 -0.386919 -0.369722 -0.375235 -0.389674 -0.606516 -0.587105 -0.585235 0.255431 -0.261515 -0.664126 0.237911 0.247261 0.245982 0.246469 0.244366 0.229383 0.227774 0.304131 0.302639 0.257025 0.256406 0.295723 0.266754 0.292995 0.266833 0.232233 0.224215 0.217723 0.228257 0.248660
chargesum: 0.00000
title: Mulliken charges with hydrogens summed into heavy atoms:
elementType: Cl Cl O O N N C C C C C C C C C C C C C C C C
charge: -0.068665 -0.069233 -0.265065 -0.255332 -0.193443 -0.105750 0.108965 0.483206 0.236904 0.293906 -0.335545 0.103214 0.103916 -0.140339 -0.147461 -0.087035 -0.093085 -0.024628 -0.025407 0.255431 0.194932 0.030514
polarizability: 3.15593503e+02 1.25720291e+00 2.37876683e+02 -2.72675091e+00 1.47233977e+01 1.21657519e+02
1716.lowfreq: -8.3817 -4.3238 -1.8352 0.0014 0.0015 0.0017 6.1327 19.2594 25.3090
frequency: -3.1131 19.2351 25.1705 31.9331 36.9453 40.4622 61.1285 79.2695 96.5136 102.4058 124.9149 141.9273 155.0786 166.5252 203.9843 212.4128 224.1182 242.1839 243.4309 274.6215 288.8751 321.3555 327.9256 363.0149 381.5689 419.5827 429.5388 463.8507 486.5310 515.8858 543.3734 546.0085 594.8635 602.2683 644.0326 653.9575 665.6901 685.4391 703.0671 744.0423 746.6483 779.1236 782.7459 784.6386 794.0621 811.5496 832.3462 840.6663 844.1792 890.5966 897.0094 917.6263 947.2770 967.1806 996.7327 1014.1639 1032.6292 1034.0637 1038.9631 1047.4730 1092.9943 1097.9821 1111.6111 1120.0044 1155.7747 1156.4545 1172.4165 1199.1776 1221.5569 1238.2414 1249.4369 1251.4213 1255.1533 1268.3019 1279.1347 1291.9249 1300.5241 1307.9482 1346.0742 1351.9037 1355.2415 1361.5044 1379.1395 1390.6454 1397.2656 1427.7886 1439.1933 1455.6159 1457.2239 1457.6491 1463.8442 1467.8555 1481.3034 1484.2322 1485.2009 1503.7112 1568.4600 1594.1102 1641.0578 1645.6282 2966.5866 2992.9031 3003.2077 3006.9700 3013.4448 3029.3051 3061.5917 3062.4532 3064.9258 3069.5982 3088.1744 3092.8022 3118.8605 3133.4108 3147.8821 3148.7142 3149.8881 3165.4010 3253.5790 3618.6452
redmass: 5.1952 6.5955 7.1228 6.9433 6.5382 6.9047 5.5032 3.7715 3.6172 2.7091 2.4335 3.8893 3.1784 3.2295 6.1883 3.2639 1.7992 3.4266 4.5645 3.7784 3.5532 4.8667 3.7266 3.2820 4.8549 3.4105 3.0120 4.5928 1.2705 3.6767 3.4476 3.8488 2.6568 5.2096 3.6983 5.6971 5.0551 5.4273 4.0963 5.6721 3.2571 1.2502 1.5067 1.3840 1.4647 1.9529 1.5472 2.7573 1.6873 4.7022 3.5507 1.3305 2.3518 2.3056 1.4010 2.9531 3.5806 2.8418 2.1057 2.4508 2.0670 1.6532 3.1612 1.3865 1.4833 1.6338 1.6241 1.1127 2.2921 2.5346 1.1950 1.1973 1.6163 1.4194 1.1194 1.2342 2.2391 1.6258 1.5177 1.3508 1.4192 1.6659 1.6219 1.2363 5.0396 2.5817 1.1322 1.1213 1.1300 1.0935 1.0434 2.4763 2.1747 1.4850 1.0563 1.1679 6.0856 5.9090 7.6013 8.3252 1.0610 1.0361 1.0958 1.0601 1.0609 1.0595 1.0803 1.0626 1.0758 1.1014 1.0973 1.1032 1.1060 1.0888 1.1046 1.1068 1.1018 1.0939 1.0991 1.0809
irintensity: 0.1825 0.4358 0.7214 0.5729 0.7963 0.0347 0.7968 0.0908 3.8931 1.1485 5.6479 1.6035 3.6316 9.1390 3.6309 1.2587 2.6669 18.5067 0.4702 1.4359 6.7206 9.2224 12.7082 2.5106 15.5554 2.9748 2.5792 10.2915 100.0299 8.5768 14.5278 11.6264 8.1215 1.8410 11.4820 14.3404 60.1942 103.3699 17.3027 0.3616 0.5926 5.0718 44.2618 29.6362 4.3295 3.2152 4.5261 13.2325 33.9334 6.9793 21.1844 1.6713 5.2583 36.9509 2.3573 75.3092 0.3660 0.1626 0.3930 5.9345 198.1008 13.8383 343.0335 30.0740 7.2618 15.7480 81.2042 0.4262 37.2020 1.4374 24.7044 19.9837 2.6317 48.5367 2.8169 3.1367 0.6424 47.5677 38.8335 16.6482 40.1528 28.3229 11.2250 23.3339 7.4092 11.8686 42.9999 21.4136 13.0581 6.9343 14.5967 40.6710 166.4368 26.1264 18.4902 55.2868 11.2568 78.8090 150.7486 54.1628 26.7538 20.2435 5.5313 28.9967 17.0520 33.8750 9.3108 5.2230 27.5801 12.5278 39.0897 0.5459 31.8021 13.2152 1.5008 30.6175 10.7154 20.3254 6.8650 68.5359
temp: 298.150 k
press: 1.00000 atm
elementType: 17 17 8 8 7 7 6 6 6 6 6 6 6 6 6 6 6 6 6 6 6 6 1 1 1 1 1 1 1 1 1 1 1 1 1 1 1 1 1 1 1 1
symmnumber: 1
zpe: 879110.9 jmol-1
zpe.correction: 0.334836 hartree
zpe.thermalcorrener: 0.356949 hartree
zpe.thermalcorrenthalpy: 0.357893 hartree
zpe.thermalcorrgfe: 0.279850 hartree
zpe.sumelectzpe: -1800.137022 hartree
zpe.sumelectthermal: -1800.114909 hartree
zpe.sumelectthermalent: -1800.113965 hartree
zpe.sumelectthermalfe: -1800.192008 hartree
dipole: -2.1952 -1.2625 -0.3162
dipole: 2.5521
quadrupole: -146.1424 -142.0684 -144.5195
quadrupole: -3.1952 -3.6602 4.8234
quadrupole: -1.8989 2.1750 -0.2761 -3.1952 -3.6602 4.8234
hfenergy: -1800.4718581 hartree
pointgroup: C01 [X(C16H20Cl2N2O2)]
dipole: 0.8616507 0.5151945 0.016138 debye
polarizability: 314.3529313|0.8779791|239.5163097|15.7211959|5.0704518|121.2584644 unknown
InChI: InChI=1S/C16H20Cl2N2O2/c1-2-22-16(21)9-12-11-19-15-4-3-13(10-14(12)15)20(7-5-17)8-6-18/h3-4,10-11,19H,2,5-9H2,1H3
charge 0 multiplicity 1
42 atoms
Cl -1.763897 -4.608267 -1.183917
Cl -7.020257 0.394542 0.34737
O  4.564814 -1.489522 0.910124
O  4.659039 0.836319 0.797953
N  -3.08574 -0.771673 -0.301197
N  1.029135 3.060584 0.141264
C  0.261371 0.909308 0.110921
C  -2.080098 0.233343 -0.198052
C  -0.131045 2.286896 0.003295
C  1.699935 0.883589 0.31826
C  -0.716714 -0.112747 0.003751
C  -2.755526 -2.193034 -0.13043
C  -4.490937 -0.43339 -0.568833
C  -2.437382 1.624063 -0.296692
C  -1.476499 2.647494 -0.202047
C  2.128627 2.213418 0.330998
C  2.502811 -0.381774 0.47868
C  -2.254523 -2.798239 -1.456496
C  -5.224911 -0.071495 0.737098
C  3.994326 -0.223636 0.736681
C  6.041025 -1.532447 1.150299
C  6.807297 -1.532382 -0.175498
H  -0.402181 -1.15847 0.072787
H  -1.99409 -2.330175 0.658373
H  -3.654275 -2.743603 0.200378
H  -4.570716 0.399279 -1.289875
H  -4.993259 -1.299836 -1.035121
H  -3.480085 1.917323 -0.446369
H  -1.787647 3.694944 -0.282331
H  1.072171 4.076129 0.112915
H  3.136126 2.597067 0.46446
H  2.098272 -0.99886 1.307028
H  2.40416 -1.025208 -0.420502
H  -1.352723 -2.294524 -1.831939
H  -3.037565 -2.815039 -2.229097
H  -4.787546 0.805374 1.235147
H  -5.281603 -0.922362 1.432221
H  6.320165 -0.666314 1.775745
H  6.183687 -2.469974 1.711031
H  7.889502 -1.650095 0.019653
H  6.480405 -2.367003 -0.819415
H  6.656855 -0.582503 -0.715319
