program: Gaussian 09
title: 000271826
version: EM64L-G09RevD.01
frameworkgroup: C1[X(C12H14N2O2)]
method: RPBEPBE
basis: SDD
operation: Freq
keyword: #p
keyword: freq=noraman
keyword: PBEPBE/SDD
title: #p freq=noraman PBEPBE/SDD
converged: YES YES NO NO
title: Mulliken charges:
elementType: O O N N C C C C C C C C C C C C H H H H H H H H H H H H H H
charge: -0.254440 -0.247031 -0.051665 -0.026758 -0.281826 -0.415251 0.138447 -0.456561 0.244516 -0.297494 -0.189733 -0.257206 -0.368660 -0.173932 -0.156966 -0.664648 0.294975 0.218760 0.260047 0.285201 0.249732 0.271855 0.235030 0.224948 0.242922 0.242289 0.234482 0.220113 0.227767 0.251086
chargesum: 0.00000
title: Mulliken charges with hydrogens summed into heavy atoms:
elementType: O O N N C C C C C C C C C C C C
charge: -0.254440 -0.247031 -0.051665 -0.026758 0.013149 0.063556 0.138447 0.078372 0.244516 -0.025639 0.053190 0.202772 -0.126370 0.060551 -0.156966 0.034319
polarizability: 1.52978167e+02 1.65607184e+01 1.33817984e+02 4.17577571e+00 -6.56333950e-01 1.33491984e+02
1716.lowfreq: -5.5099 -0.0003 -0.0001 0.0007 0.6032 6.7185 23.3783 31.9474 46.2532
frequency: 23.3395 31.9330 46.1943 57.1013 67.6566 90.3958 108.6615 143.9279 167.9887 202.3842 220.2896 251.6249 276.8936 316.7077 366.1166 376.2281 404.6600 410.7966 462.5737 485.6420 551.5638 566.5570 617.1018 666.6487 707.4027 740.1795 753.7854 771.9631 794.9591 817.0011 847.2020 870.5363 904.0584 919.0557 963.0397 963.8559 1005.5079 1006.6702 1014.5574 1026.9245 1043.0278 1085.1329 1096.3250 1103.7173 1152.4141 1156.3770 1169.1201 1185.1976 1203.4890 1230.8044 1263.6145 1279.4434 1292.9564 1301.3238 1316.4124 1334.6255 1355.7411 1361.4948 1393.4410 1412.2552 1449.6460 1453.1578 1455.4922 1458.5465 1464.5072 1484.8685 1562.9722 1580.2932 1621.4057 2190.9742 2993.9447 3000.3650 3004.0613 3027.4994 3032.5142 3062.7600 3089.1192 3095.2649 3104.8910 3121.4665 3129.6840 3142.9347 3159.4729 3173.7678
redmass: 5.2222 6.3668 4.9216 3.0271 7.2959 4.3605 4.2890 3.8449 4.0029 4.3391 1.3191 2.6387 3.4417 3.0196 5.6054 2.9758 3.3738 3.6980 4.2847 3.3744 4.3958 4.0296 6.9836 3.9776 4.5948 3.1685 1.6116 2.6199 2.2082 1.4064 3.9649 2.4503 1.4105 2.6201 3.6608 1.7346 1.5414 1.8947 2.9737 2.8893 2.3702 2.0084 2.1793 2.3556 1.8932 1.6349 1.0799 1.6338 2.0825 1.6128 1.4166 1.1500 1.4773 1.9521 1.8235 1.5751 1.2899 1.4252 1.2324 1.9803 1.2582 1.0846 1.5314 1.1540 1.0427 1.0520 5.9722 5.5341 9.5663 12.3994 1.0361 1.0822 1.0598 1.0651 1.0597 1.0976 1.0974 1.1030 1.1006 1.1065 1.0885 1.0893 1.0948 1.1017
irintensity: 0.6468 4.2097 2.9237 0.6446 3.1677 1.1204 6.5293 3.3084 2.3667 2.5744 2.6400 1.4440 4.0936 13.0013 4.9311 2.2985 4.1764 2.7829 2.4783 11.7366 11.2193 2.6922 2.0090 9.3492 7.2827 10.5183 38.7696 10.1683 29.1322 3.9689 2.0647 6.0111 5.6725 19.1272 4.6862 0.6457 1.8735 3.4546 72.3297 35.8526 6.3548 1.8401 25.5487 18.0584 201.7452 5.4690 2.3029 101.3135 42.1531 28.2204 11.9836 9.3014 1.3465 5.3626 6.6189 2.0590 0.7270 3.7291 25.9231 25.0915 10.6307 24.0745 36.8884 22.1108 14.9826 13.7885 16.2132 39.0298 149.7137 14.4037 18.6545 2.1346 15.0983 22.0758 27.0866 6.8190 33.7438 1.2295 6.8740 27.7331 12.1282 8.9181 13.1177 19.9769
temp: 298.150 k
press: 1.00000 atm
elementType: 8 8 7 7 6 6 6 6 6 6 6 6 6 6 6 6 1 1 1 1 1 1 1 1 1 1 1 1 1 1
symmnumber: 1
zpe: 625743.9 jmol-1
zpe.correction: 0.238333 hartree
zpe.thermalcorrener: 0.254322 hartree
zpe.thermalcorrenthalpy: 0.255266 hartree
zpe.thermalcorrgfe: 0.192378 hartree
zpe.sumelectzpe: -724.431632 hartree
zpe.sumelectthermal: -724.415643 hartree
zpe.sumelectthermalent: -724.414699 hartree
zpe.sumelectthermalfe: -724.477587 hartree
dipole: 0.5454 -4.0418 -3.1865
dipole: 5.1757
quadrupole: -78.6015 -102.7252 -98.2230
quadrupole: 9.4726 -1.3103 -10.7424
quadrupole: 14.5817 -9.5420 -5.0397 9.4726 -1.3103 -10.7424
hfenergy: -724.6699651 hartree
pointgroup: C01 [X(C12H14N2O2)]
dipole: -0.02938 -1.8451797 0.8607057 debye
polarizability: 157.2155443|-13.5604919|129.0118511|2.4826167|-0.6185102|134.06074 unknown
InChI: InChI=1S/C12H14N2O2/c1-2-16-12(15)10(6-5-8-13)11-7-3-4-9-14-11/h3-4,7,9-10H,2,5-6H2,1H3
charge 0 multiplicity 1
30 atoms
O  -2.213017 -0.795359 0.335043
O  -1.637944 -0.555393 -1.911172
N  1.522154 -0.382401 1.099691
N  0.4652 4.412307 -0.323178
C  -0.337692 0.656826 -0.193421
C  -0.698584 1.362295 1.131379
C  0.963561 -0.169379 -0.128446
C  0.302483 2.486621 1.515253
C  -1.453374 -0.270675 -0.704389
C  1.534632 -0.686982 -1.319748
C  2.714477 -1.45496 -1.235571
C  -3.316337 -1.736241 -0.048291
C  2.665802 -1.12567 1.167647
C  3.295827 -1.683272 0.034049
C  0.397607 3.556197 0.506582
C  -4.592165 -0.961578 -0.38674
H  -0.211421 1.410513 -0.995772
H  -1.716166 1.784702 1.052085
H  -0.700018 0.623804 1.948437
H  1.301574 2.040726 1.672097
H  -0.006169 2.938561 2.476838
H  1.046563 -0.49732 -2.280977
H  -2.973987 -2.344529 -0.903689
H  -3.435747 -2.365966 0.84746
H  3.172755 -1.865714 -2.141301
H  3.08177 -1.269906 2.171401
H  4.211836 -2.271735 0.144788
H  -5.417428 -1.671642 -0.580606
H  -4.890694 -0.307264 0.450431
H  -4.449897 -0.346367 -1.290878
