program: Gaussian 09
title: 000271816
version: EM64L-G09RevD.01
frameworkgroup: C1[X(C7H12O3)]
method: RPBEPBE
basis: SDD
operation: Freq
keyword: #pfreq=noraman
keyword: PBEPBE/SDD
title: #p freq=noraman PBEPBE/SDD
converged: YES YES NO NO
title: Mulliken charges:
elementType: O O O C C C C C C C H H H H H H H H H H H H
charge: -0.454465 -0.409781 -0.244662 -0.138456 -0.103780 -0.451209 -0.428247 -0.392484 -0.395791 0.162799 0.265857 0.216921 0.221955 0.219343 0.215664 0.191881 0.207315 0.198850 0.207097 0.198731 0.337824 0.374636
chargesum: 0.00000
title: Mulliken charges with hydrogens summed into heavy atoms:
elementType: O O O C C C C C C C
charge: -0.116641 -0.035144 -0.244662 0.127402 0.113141 -0.009911 -0.020702 0.013681 0.010037 0.162799
polarizability: 9.45613085e+01 4.59439671e-02 7.88793300e+01 -1.55239938e+00 2.09496297e+00 7.23493015e+01
1716.lowfreq: -18.4236 -0.0005 0.0000 0.0003 7.4741 17.9735 43.3075 94.2427 144.7861
frequency: 43.2303 94.2148 144.7758 165.6211 243.8598 261.8621 276.2803 316.5977 380.5201 414.8903 440.5101 467.2742 531.1556 605.0541 612.0578 711.0284 783.9140 829.6143 844.8645 881.3414 903.2372 945.5300 966.1730 1018.0126 1042.7050 1056.8975 1062.4261 1098.8911 1109.2967 1137.4668 1160.0048 1224.1415 1234.9957 1253.7059 1261.6561 1289.3458 1310.3857 1327.0248 1334.4650 1342.2097 1345.0371 1361.3738 1396.2374 1464.2604 1466.9088 1471.3744 1477.7116 1658.8452 2962.0365 2972.0089 2976.7687 2977.9339 2987.3615 3031.8776 3037.4258 3039.2716 3046.7516 3059.5794 3503.3378 3568.2867
redmass: 6.8386 3.6859 4.5613 2.9093 2.2155 1.7783 2.4195 1.7389 4.4535 3.8627 2.5490 3.6354 2.1804 1.7030 2.3433 3.9366 1.8284 2.3434 1.7550 2.1860 1.6930 2.3802 3.8132 3.4732 1.6522 1.6368 1.8141 1.7263 2.1548 2.0526 1.2919 1.3536 1.3482 1.3318 1.3817 1.3241 1.2079 1.3361 1.4750 1.3845 1.5506 1.6830 1.6091 1.0903 1.0899 1.0841 1.0949 8.2622 1.0839 1.0618 1.0616 1.0633 1.0618 1.0973 1.0939 1.0943 1.1017 1.0996 1.0637 1.0662
irintensity: 3.4790 1.4880 3.2610 1.3453 31.2936 54.4697 54.8711 0.4427 7.9771 4.6539 6.7487 16.5817 2.0986 97.0832 53.1355 49.3833 0.6543 11.3459 15.3409 2.9537 3.8163 14.9426 71.3061 56.0037 63.0045 48.9358 115.1078 8.2678 0.8723 13.5049 39.7077 0.5548 7.7069 4.0306 21.7174 8.9475 2.1746 2.5754 7.9108 1.6081 5.3501 39.8621 22.2601 6.3915 11.2079 20.5927 3.0128 207.4178 17.8550 34.1714 31.5405 41.8389 18.6204 39.9105 45.2450 6.7080 37.7599 74.2199 18.5113 4.0330
temp: 298.150 k
press: 1.00000 atm
elementType: 8 8 8 6 6 6 6 6 6 6 1 1 1 1 1 1 1 1 1 1 1 1
symmnumber: 1
zpe: 484078.6 jmol-1
zpe.correction: 0.184376 hartree
zpe.thermalcorrener: 0.194446 hartree
zpe.thermalcorrenthalpy: 0.195390 hartree
zpe.thermalcorrgfe: 0.148819 hartree
zpe.sumelectzpe: -498.822749 hartree
zpe.sumelectthermal: -498.812679 hartree
zpe.sumelectthermalent: -498.811735 hartree
zpe.sumelectthermalfe: -498.858306 hartree
dipole: -2.2855 -0.2489 -0.1373
dipole: 2.3031
quadrupole: -55.3525 -55.3585 -65.6455
quadrupole: -3.2351 -3.1472 2.9753
quadrupole: 3.4330 3.4270 -6.8600 -3.2351 -3.1472 2.9753
hfenergy: -499.0071245 hartree
pointgroup: C01 [X(C7H12O3)]
dipole: -0.8983447 -0.115448 -0.025823 debye
dipolederiv: -0.5995158 -0.2738969 -0.1117752 -0.235786 -0.6729436 0.1954544 -0.0790855 0.2369905 -0.3836831 -0.751557 0.149556 0.5381948 0.1481613 -0.4318631 -0.1383284 0.4675766 -0.1147404 -0.758145 -0.7290064 -0.0157461 -0.2249576 0.0526069 -0.3614371 -0.0937159 -0.0267121 -0.1353277 -0.8939068 -0.3530675 0.0057233 -0.0298928 -0.0933277 -0.0832443 -0.0136539 -0.0116096 -0.0173996 0.06604 0.4620111 0.1287289 0.0149065 0.084582 0.6272582 -0.1116444 -0.0387171 -0.0644458 0.3094285 0.039765 0.0422452 -0.0208967 0.1382086 0.1391566 0.0236391 -0.0871726 -0.0382174 0.1209998 -0.1013898 -0.1129649 -0.0074301 -0.010229 -0.006519 0.0490558 0.0199338 0.0261611 0.1069562 0.0530412 0.006631 -0.0007684 -0.0544331 0.0366271 -0.0211519 0.0613711 0.02732 0.1563622 0.0735391 -0.0083257 0.0289098 0.0225609 0.0530408 -0.0077113 -0.0322495 -0.0199255 0.1506133 1.450722 -0.1233851 -0.1568538 -0.1915577 0.2783676 0.2550778 -0.2077675 0.2654551 1.3174135 0.0732417 0.0079673 -0.0262274 0.0033209 0.0671337 0.0061123 -0.0115795 0.0010815 -0.0817379 0.0187429 -0.0219198 -0.0092047 -0.0101651 -0.0057928 0.0247728 0.0074862 0.0231413 -0.1688141 0.0411591 -0.0280646 -0.0192278 -0.028429 0.0703142 -0.0284987 -0.0234232 0.0399661 -0.1333208 -0.0097234 0.09608 0.0395153 0.078892 -0.1130006 -0.0421472 0.046648 -0.0740207 0.0561269 0.0457749 -0.0152575 0.011614 -0.0196162 0.0737266 -0.0111926 -0.0413289 0.0342318 -0.1509842 -0.0115492 0.0795759 0.0239139 0.104899 -0.1649954 -0.0594096 0.036922 -0.0946669 0.0494064 -0.0374104 -0.1006487 0.029019 -0.0997008 -0.1410498 0.057759 0.0442961 0.0854656 0.0537862 0.0340286 0.0251519 -0.0055785 0.0360616 0.0723606 0.0101103 -0.0492077 -0.0504442 -0.1798226 -0.2268307 -0.0047152 -0.0323046 0.0009109 0.0347335 0.0039865 -0.0652744 0.0034389 0.0716885 0.0931704 0.0023944 -0.0409425 -0.0004017 0.0187956 -0.0018482 0.0335165 0.0006831 -0.188048 0.2754674 0.1610002 0.1040086 0.0874147 0.1301068 -0.0767743 0.1134608 -0.1139471 0.2399068 0.1593865 -0.0001295 -0.1040218 -0.0139725 0.3792244 -0.0198915 -0.1570835 -0.0207997 0.2397344 unknown
polarizability: 94.4681284|0.2361228|79.1166082|-2.1268873|1.6428418|72.2052034 unknown
InChI: InChI=1S/C7H12O3/c8-6-4-2-1-3-5(6)7(9)10/h5-6,8-9H,1-4H2
charge 0 multiplicity 1
22 atoms
O  0.312017 2.150275 -0.492044
O  2.636227 -0.557387 -0.952804
O  2.179873 -0.039244 1.26166
C  0.313253 -0.24404 -0.347241
C  -0.389581 1.029154 0.165238
C  -0.398211 -1.521029 0.196572
C  -1.892634 1.025809 -0.176857
C  -1.903236 -1.51783 -0.155323
C  -2.597874 -0.239718 0.368044
C  1.765421 -0.242094 0.098023
H  0.284254 -0.240323 -1.451708
H  -0.252553 1.086325 1.267339
H  -0.271358 -1.560182 1.296547
H  0.093445 -2.419406 -0.221187
H  -1.998223 1.07289 -1.278888
H  -2.367846 1.938793 0.235693
H  -2.383431 -2.417774 0.274194
H  -2.026572 -1.579632 -1.255674
H  -3.664557 -0.231012 0.074938
H  -2.56975 -0.235061 1.477204
H  -0.003609 3.003921 -0.101958
H  3.571646 -0.555434 -0.609666
