program: Gaussian 09
title: 000271825
version: EM64L-G09RevD.01
frameworkgroup: C1[X(C10H11NO4)]
method: RPBEPBE
basis: SDD
operation: Freq
keyword: #p
keyword: freq=noraman
keyword: PBEPBE/SDD
title: #p freq=noraman PBEPBE/SDD
converged: YES YES NO NO
title: Mulliken charges:
elementType: O O O O N C C C C C C C C C C H H H H H H H H H H H
charge: -0.239867 -0.271004 -0.226357 -0.216173 -0.009685 -0.077154 0.124415 -0.292586 -0.179858 -0.167081 -0.363531 0.316934 0.310058 -0.753699 -0.749075 0.299724 0.266401 0.241687 0.234113 0.246298 0.246831 0.251294 0.255296 0.245191 0.247823 0.260008
chargesum: 0.00000
title: Mulliken charges with hydrogens summed into heavy atoms:
elementType: O O O O N C C C C C C C C C C
charge: -0.239867 -0.271004 -0.226357 -0.216173 -0.009685 0.222570 0.124415 -0.026185 0.061829 0.067032 -0.117234 0.316934 0.310058 -0.000279 0.003947
polarizability: 1.56312445e+02 3.27731525e+00 1.09757309e+02 -1.22824995e+00 9.45735661e+00 1.07059779e+02
1716.lowfreq: -7.1552 -2.9710 -0.0003 0.0003 0.0007 3.4811 25.8462 30.0882 40.4457
frequency: 25.7291 30.0677 40.4206 46.2055 62.3374 76.2905 77.6767 88.5666 170.5576 206.2627 235.2978 254.3347 297.6176 338.8222 400.8295 427.7116 501.7502 530.0895 554.3295 563.7286 579.7015 615.6296 626.0210 663.3061 752.9725 773.1655 821.7548 847.3902 884.7315 905.7419 917.8574 960.8412 966.4014 974.2417 983.6668 1006.0031 1009.8604 1039.2087 1041.6542 1042.5594 1088.0417 1163.1961 1169.8236 1196.4027 1231.6953 1279.3748 1308.6109 1321.7101 1347.0497 1383.8259 1384.3769 1417.7259 1451.7845 1452.3180 1452.8533 1453.7107 1458.1613 1569.4007 1584.4712 1667.2078 1683.0380 3007.6175 3009.2460 3063.7572 3097.7443 3099.4346 3133.5642 3142.8889 3144.7113 3145.6518 3166.4352 3179.2197
redmass: 4.5122 3.4730 1.4083 2.6312 2.3565 1.8576 3.6083 3.3037 6.5742 5.6329 7.4541 5.0629 3.6810 5.8230 3.3034 3.9857 4.1281 3.3016 3.2301 3.9811 5.2860 7.0799 5.2830 5.7077 2.0482 2.0336 4.7962 6.4454 5.4266 1.9095 2.5527 5.3345 1.4945 3.9860 1.9936 1.3744 2.6521 2.2466 1.6663 1.6690 1.6362 1.0958 2.8061 3.5334 1.9997 1.6342 1.2048 5.7481 1.6498 1.2416 1.2511 1.9856 1.0550 1.0534 1.0547 1.0509 2.3917 6.0833 5.8809 9.8534 10.2106 1.0377 1.0366 1.0856 1.0972 1.0953 1.0878 1.1019 1.1012 1.0906 1.0962 1.0996
irintensity: 1.3242 1.0150 1.4609 2.5820 0.7817 1.8090 1.0923 2.8474 0.5128 10.2164 2.5774 2.5145 4.9134 5.8057 2.7353 5.6876 19.5672 23.6480 4.2757 11.9267 1.6078 3.3017 2.3409 13.4764 33.2485 40.5735 5.1653 23.3151 265.3720 141.9974 101.6112 13.7839 2.5640 37.1080 33.1718 5.4404 120.1562 4.9924 8.9863 9.6177 10.5747 8.7410 242.1889 395.9714 6.9331 0.2538 4.0072 10.0909 10.6511 64.6013 49.8522 10.2136 22.6318 25.3893 26.6236 13.7039 17.7695 11.5120 25.9586 110.6824 262.3960 1.3003 1.3864 6.7145 5.3947 6.6871 7.2703 9.3051 10.1183 12.8441 25.2899 8.0212
temp: 298.150 k
press: 1.00000 atm
elementType: 8 8 8 8 7 6 6 6 6 6 6 6 6 6 6 1 1 1 1 1 1 1 1 1 1 1
symmnumber: 1
zpe: 511980.1 jmol-1
zpe.correction: 0.195003 hartree
zpe.thermalcorrener: 0.210362 hartree
zpe.thermalcorrenthalpy: 0.211306 hartree
zpe.thermalcorrgfe: 0.148794 hartree
zpe.sumelectzpe: -742.204883 hartree
zpe.sumelectthermal: -742.189524 hartree
zpe.sumelectthermalent: -742.188580 hartree
zpe.sumelectthermalfe: -742.251092 hartree
dipole: 2.2915 0.2144 -4.4065
dipole: 4.9713
quadrupole: -73.4756 -78.0068 -90.5256
quadrupole: -1.9897 5.9448 5.4220
quadrupole: 7.1938 2.6625 -9.8563 -1.9897 5.9448 5.4220
hfenergy: -742.3998854 hartree
pointgroup: C01 [X(C10H11N1O4)]
dipole: 0.4209431 1.3838513 -1.3164943 debye
dipolederiv: -1.7644117 0.109393 0.601288 0.0674252 -0.5878188 -0.1335309 0.4443861 -0.1442495 -0.4857398 -0.5689728 -0.3832252 -0.1941575 -0.2050139 -1.5885988 -0.4404723 -0.0930503 -0.5293139 -0.6616209 -0.7320532 0.0177065 0.1920438 -0.3853215 -0.8118755 0.168206 0.1996107 -0.0010508 -0.3666004 -0.3607835 0.1425675 -0.1658277 -0.0460249 -0.9008254 -0.031831 -0.1562791 0.3285665 -0.5850956 -0.4104409 -0.1035774 -0.047701 -0.0970987 -0.2664298 -0.007506 -0.0394343 -0.0026295 -0.315057 1.177086 0.166902 -0.1531365 -0.2787058 0.7917715 0.3925919 -0.0553349 0.6821756 0.7244314 0.3852469 0.1978444 0.0647463 0.0986278 -0.0221911 -0.0214462 -0.1305581 -0.1494864 0.056119 -0.2584091 -0.0840535 0.0722321 -0.0930755 -0.1218858 0.0217543 0.1700917 0.0758917 -0.0433915 0.0942243 0.1047809 -0.049182 0.1067494 -0.0612693 -0.0594788 -0.0292711 -0.0565506 0.1639401 0.0125665 0.0504232 0.0326031 0.0694537 -0.0780757 0.0350741 -0.1178827 -0.0408185 -0.2245837 0.098867 0.05121 0.0539677 0.0475985 -0.0323971 -0.0316404 0.2587189 0.0489307 0.3168338 1.7637702 -0.194779 -0.6624674 0.3926475 1.1241751 -0.1901573 -0.6788065 0.0318747 0.4827627 0.4293151 0.114472 0.4198582 0.3389794 2.0673498 0.3737947 0.4143993 -0.1208547 0.8713463 -0.1637341 0.1504235 0.0612067 0.2119103 -0.3239383 -0.0738613 0.0645276 -0.0181475 0.0010006 -0.1179479 -0.1024781 -0.2373536 -0.0457531 -0.0695664 -0.0733568 -0.1926014 -0.1189693 -0.2554526 0.0201336 -0.0482503 0.0102197 0.0854774 0.0690815 0.0186069 0.0097059 -0.0257768 0.0142033 0.0966655 -0.0054986 -0.073126 -0.0065166 0.1632195 -0.0129048 -0.0925958 -0.0286266 0.0003558 0.0633117 -0.0469185 0.0593612 -0.0539333 0.1130926 0.0531339 0.073191 0.0625115 -0.044199 -0.069701 -0.1040893 -0.0110241 -0.1063716 0.1111723 0.0019217 -0.0005042 0.0088278 0.1006057 0.014595 -0.0432906 -0.0840399 -0.0367324 0.1172853 -0.0076762 -0.1160751 -0.0242229 -0.044877 -0.0604723 -0.0080782 0.0802808 -0.0429165 0.0727233 0.0231884 0.0850001 0.0052485 0.0916608 0.1094581 0.0351334 0.0135798 0.015224 0.0861371 0.0586577 -0.023427 0.0812622 -0.0310515 0.0493297 -0.047354 -0.0762029 -0.037352 0.0668566 -0.0614662 -0.0397756 -0.0880785 0.0568696 0.1058959 -0.0383081 0.0825478 -0.0599758 0.0502046 0.083956 0.0321704 0.060121 0.0036906 0.1225659 0.0386344 -0.0002891 0.0159141 -0.0827621 -0.0573059 -0.0265897 -0.0230654 0.0771211 -0.0361048 0.0304101 0.0105723 0.0447842 0.1145648 -0.0282515 0.0403842 -0.0135694 0.0967283 unknown
polarizability: 145.5999164|22.3928419|110.3338751|-0.0604847|4.1712138|117.1957411 unknown
InChI: InChI=1S/C10H11NO4/c1-7(12)14-10(15-8(2)13)9-5-3-4-6-11-9/h3-6,10H,1-2H3
charge 0 multiplicity 1
26 atoms
O  -1.158175 0.824587 0.608659
O  -0.654592 -0.8828 -0.936813
O  -2.744091 -0.746965 1.311196
O  -0.400231 -3.030662 -0.028108
N  1.836545 0.477213 1.378234
C  -0.216779 -0.27468 0.331035
C  1.156432 0.348402 0.200126
C  1.671047 0.776801 -1.044954
C  2.952364 1.370579 -1.07357
C  3.667989 1.514187 0.13709
C  3.070647 1.053923 1.333833
C  -2.421403 0.442585 1.126337
C  -0.797957 -2.298505 -0.951469
C  -3.256764 1.672563 1.3897
C  -1.486514 -2.724678 -2.225078
H  -0.256325 -1.028947 1.136764
H  1.078121 0.639327 -1.953011
H  3.383753 1.713622 -2.019744
H  4.664614 1.966205 0.15838
H  3.592028 1.141179 2.293708
H  -4.223531 1.379438 1.823092
H  -3.421044 2.224732 0.448016
H  -2.724497 2.350689 2.078421
H  -1.12009 -2.140926 -3.084779
H  -1.328763 -3.799989 -2.392661
H  -2.570784 -2.533381 -2.128305
