program: Gaussian 09
title: 000271815
version: EM64L-G09RevD.01
frameworkgroup: C1[X(C11H12O2)]
method: RPBEPBE
basis: SDD
operation: Freq
keyword: #pfreq=noraman
keyword: PBEPBE/SDD
title: #p freq=noraman PBEPBE/SDD
converged: YES YES NO NO
title: Mulliken charges:
elementType: O O C C C C C C C C C C C H H H H H H H H H H H H
charge: -0.254245 -0.251398 0.198049 0.153442 0.065121 0.216953 0.228977 -0.438097 -0.811650 -0.367625 -0.800869 -0.223080 -0.533089 0.237498 0.231344 0.235266 0.235276 0.237963 0.238244 0.238247 0.258363 0.217501 0.221022 0.245771 0.221015
chargesum: 0.00000
title: Mulliken charges with hydrogens summed into heavy atoms:
elementType: O O C C C C C C C C C C C
charge: -0.254245 -0.251398 0.198049 0.153442 0.065121 0.216953 0.228977 -0.200599 -0.109763 -0.129662 -0.066015 -0.005579 0.154718
polarizability: 1.73368835e+02 -5.54328076e+00 1.42197313e+02 3.53805403e-03 1.74116547e-03 6.53287885e+01
1716.lowfreq: -83.8819 -6.6868 -2.7087 -0.0005 0.0001 0.0005 10.3399 72.5184 110.2436
frequency: -83.8355 72.4938 110.2431 125.0096 144.2350 152.7251 202.6286 227.6412 255.0898 277.0218 321.3279 325.3397 348.0898 452.2330 539.9834 546.7369 561.9537 570.4488 613.1521 635.5186 679.4935 726.0271 778.8105 779.8037 831.0651 851.4149 906.9326 943.3638 948.8438 1024.4813 1034.5129 1046.5139 1060.0238 1107.2265 1110.7348 1148.9704 1155.1406 1169.3413 1197.5734 1250.3261 1256.4534 1364.1287 1400.4753 1405.4943 1422.5171 1427.8038 1434.7607 1462.5937 1465.1428 1466.3036 1472.1197 1474.1361 1476.7122 1485.2458 1590.6111 1629.1887 1638.3607 2958.6790 2970.6108 2983.1430 3043.5156 3046.8919 3058.3370 3082.0202 3103.2482 3126.8752 3131.3073 3154.4991 3168.5570
redmass: 1.0201 3.1499 1.6024 1.5197 4.0884 3.6991 1.6996 2.5720 1.7283 3.0725 4.4296 4.2476 4.1459 6.1649 4.2753 4.1164 5.2704 4.9306 4.4087 4.4843 5.9601 1.8577 2.4289 4.3806 5.9343 1.4143 4.1609 1.9310 1.3012 3.7390 1.3865 1.4970 2.0556 2.2437 1.2584 1.6502 2.0473 2.5239 1.7612 2.5858 2.6960 2.5020 1.4250 1.2631 4.0149 4.8028 1.2787 1.0446 1.0507 1.0845 1.1555 1.0445 1.2604 1.7664 6.9684 9.1579 7.8932 1.0329 1.0375 1.0379 1.0980 1.1040 1.0983 1.0976 1.0974 1.0991 1.0863 1.0928 1.0969
irintensity: 0.0115 8.4187 1.7332 3.2501 0.4049 4.1830 0.0011 0.3705 0.2066 0.3648 0.5416 0.7731 2.0187 1.1657 0.5536 0.0013 5.9841 0.0002 10.9018 0.0376 6.6587 43.1598 50.8327 2.7413 9.3451 0.3080 6.1487 9.7035 1.0013 72.1883 5.4891 0.0327 19.3930 73.2893 0.1391 9.3041 0.6131 56.8178 40.8320 0.0762 102.1034 11.6963 3.1052 14.5424 42.3289 23.0473 0.2083 27.8496 14.7652 21.8127 54.4138 0.1900 15.2596 18.8608 44.7418 60.4863 13.1900 71.5800 39.5969 30.1720 21.6999 49.6985 16.3092 20.8991 7.3259 23.9502 5.9409 18.4745 16.4632
temp: 298.150 k
press: 1.00000 atm
elementType: 8 8 6 6 6 6 6 6 6 6 6 6 6 1 1 1 1 1 1 1 1 1 1 1 1
symmnumber: 1
zpe: 525951.4 jmol-1
zpe.correction: 0.200324 hartree
zpe.thermalcorrener: 0.212134 hartree
zpe.thermalcorrenthalpy: 0.213078 hartree
zpe.thermalcorrgfe: 0.162790 hartree
zpe.sumelectzpe: -575.850380 hartree
zpe.sumelectthermal: -575.838570 hartree
zpe.sumelectthermalent: -575.837626 hartree
zpe.sumelectthermalfe: -575.887915 hartree
dipole: -0.0855 0.8389 0.0015
dipole: 0.8433
quadrupole: -54.1440 -74.0078 -80.0646
quadrupole: -0.7681 -0.0029 -0.0017
quadrupole: 15.2615 -4.6023 -10.6591 -0.7681 -0.0029 -0.0017
hfenergy: -576.0507046 hartree
pointgroup: C01 [X(C11H12O2)]
dipole: 0.0435046 0.3288968 -0.0030123 debye
dipolederiv: -0.7833974 0.0706307 0.0037628 -0.1984842 -0.6301361 0.0046014 0.0055056 0.0028492 -0.1226925 -1.1386871 0.542704 0.0020886 0.840926 -0.8915746 -0.0014698 0.000097 0.0006361 -0.2755256 0.2709088 0.3030624 -0.0036526 0.0309264 0.0117813 -0.0002417 -0.001916 -0.0019598 0.0060415 0.0385967 -0.2733289 0.0008712 -0.2304375 -0.1938035 0.0020436 0.0006295 0.0022766 -0.1064195 -0.1885564 0.2363596 -0.0002427 0.5506093 0.2447082 -0.0050364 -0.0022365 -0.0030484 0.0161973 0.5642056 0.0165221 -0.0038115 0.000961 0.5280085 -0.0035694 -0.0036844 -0.0036404 -0.0174504 0.7841597 -0.4490468 -0.0014392 -0.876125 0.9170045 0.0003139 0.0014375 -0.0026394 0.0911428 -0.1385081 -0.0694888 0.0000034 0.0032959 -0.0401027 -0.0012008 -0.0004797 -0.0007432 -0.2126686 0.0048146 0.0175668 0.0005241 0.0180113 0.0382248 0.0002921 0.0005014 0.0003433 0.1028135 -0.1557062 -0.114052 0.0002023 0.1792773 -0.3374957 -0.0005693 -0.0016958 0.0014346 -0.2441703 -0.1121793 -0.1079249 0.0019547 -0.0570213 -0.0474949 0.0012237 0.0015799 0.0015235 0.0823103 0.108417 0.0041685 -0.0017326 -0.0626182 0.1463154 -0.0015834 -0.0013103 -0.0020475 -0.1554118 0.8665114 -0.2959942 -0.0015857 -0.0127845 0.2217846 0.0007955 -0.0035284 0.0027135 0.3277178 0.0228288 0.1105923 0.0002023 0.0736818 -0.0417264 0.0009257 0.0004382 0.0007169 0.1691058 -0.1038589 -0.0585013 0.0017894 -0.1486096 0.0225294 0.0015668 0.0024015 0.0009455 0.1038759 0.066073 0.0160619 -0.0226552 0.0745804 -0.0131313 -0.1077104 0.0388489 -0.1272469 -0.0465756 0.065772 0.0181178 0.0208614 0.0754939 -0.0099301 0.1062125 -0.0414199 0.126521 -0.0495719 -0.1146269 -0.0000775 0.0018342 -0.008328 0.1010014 0.0005446 0.0018482 0.0004877 0.1749593 -0.0258602 -0.063286 0.0950534 -0.0359029 0.0544877 -0.0429096 0.1305863 0.0151989 -0.0375413 -0.0286835 -0.0647478 -0.0943126 -0.0371264 0.0548232 0.0421526 -0.1302133 -0.0156135 -0.0350778 0.0749994 0.1140891 -0.000421 0.0314238 -0.0471301 0.0009738 0.0001361 0.0004546 0.1294635 0.0263039 -0.0965916 0.0014827 -0.0879992 -0.1011461 0.0022727 0.0014491 0.0023359 0.15836 -0.0663419 0.0404957 0.0404556 -0.1244093 0.0603638 0.1164945 0.090915 0.0636478 -0.092761 0.0310921 0.0635773 0.0002068 0.1278091 -0.1054444 0.0005409 -0.0001934 0.0009657 0.1225757 -0.0682772 0.0390914 -0.0414398 -0.1271501 0.0580831 -0.1166637 -0.0896964 -0.0661115 -0.0886971 unknown
polarizability: 173.6687421|4.5939533|141.8893075|-0.7248407|-0.5288635|65.336887 unknown
InChI: InChI=1S/C11H12O2/c1-7-8(2)13-11-9(7)5-4-6-10(11)12-3/h4-6H,1-3H3
charge 0 multiplicity 1
25 atoms
O  -0.589851 -1.441691 0.012785
O  2.302695 -1.453515 -0.005554
C  -0.6149 0.876753 -0.002209
C  -1.996213 0.402931 0.009678
C  0.205358 -0.282698 0.000169
C  -1.943561 -0.980673 0.018393
C  1.616123 -0.235013 -0.009203
C  -0.011064 2.162441 -0.014527
C  -3.229514 1.265703 0.011939
C  2.204395 1.053964 -0.02142
C  -2.983251 -2.057535 0.032025
C  1.394771 2.226608 -0.023961
C  3.766723 -1.3923 -0.016225
H  -0.61712 3.073906 -0.016709
H  -4.150697 0.658013 0.022301
H  -3.254088 1.928822 0.897894
H  -3.266034 1.916511 -0.882693
H  3.293092 1.161658 -0.029008
H  -3.627956 -1.991704 0.927887
H  -3.639136 -2.003519 -0.856486
H  -2.493196 -3.044801 0.035499
H  1.893646 3.202231 -0.033614
H  4.141109 -0.885711 -0.927205
H  4.094121 -2.44208 -0.012011
H  4.153849 -0.874501 0.883057
