program: Gaussian 09
title: 000271821
version: EM64L-G09RevD.01
frameworkgroup: C1[X(C14H14O2)]
method: RPBEPBE
basis: SDD
operation: Freq
keyword: #pfreq=noraman
keyword: PBEPBE/SDD
title: #p freq=noraman PBEPBE/SDD
converged: YES YES NO NO
title: Mulliken charges:
elementType: O O C C C C C C C C C C C C C C H H H H H H H H H H H H H H
charge: -0.256817 -0.392183 -0.424754 -0.548813 -0.540748 0.352769 0.265920 -0.131973 -0.417062 0.397775 -0.257389 -0.375623 -0.383197 -0.244864 -0.237444 -0.238841 0.214157 0.225497 0.223110 0.239971 0.199847 0.234930 0.271288 0.297498 0.233355 0.242611 0.227216 0.229220 0.231056 0.363487
chargesum: 0.00000
title: Mulliken charges with hydrogens summed into heavy atoms:
elementType: O O C C C C C C C C C C C C C C
charge: -0.256817 -0.028695 0.014900 -0.085732 -0.105971 0.352769 0.265920 -0.131973 -0.145775 0.397775 0.040109 -0.142268 -0.140586 -0.017648 -0.008224 -0.007785
polarizability: 3.02041019e+02 7.33579105e-01 1.48727060e+02 2.27733438e+00 -5.42710904e+00 8.08066473e+01
1716.lowfreq: -5.1829 -0.0008 -0.0004 0.0002 5.4653 11.2504 28.2992 36.0379 51.0467
frequency: 28.2908 35.8406 51.0379 86.5065 131.4217 178.3102 203.3982 230.5193 239.6673 256.1309 321.0595 347.1453 369.0772 404.9074 419.6828 462.0591 482.4812 524.6884 553.1143 561.2068 607.5134 616.5993 662.0058 700.6396 708.9270 736.0668 766.1095 802.9603 850.1917 858.5850 894.7692 914.5207 923.9624 929.0947 933.4700 955.8905 975.9901 988.0446 995.9680 1027.4999 1056.0145 1065.2018 1085.2903 1112.3085 1131.1239 1155.3773 1173.1714 1176.1329 1192.4959 1217.2707 1261.8361 1264.3781 1302.9520 1321.0996 1325.5199 1332.0283 1334.9252 1352.3430 1366.9801 1387.5792 1435.3413 1456.0201 1472.1286 1472.7615 1483.2316 1499.7711 1578.1274 1605.0433 1608.3711 1647.1256 2924.2134 2952.7706 2970.8591 2997.2478 3055.8545 3074.4266 3094.5699 3123.0877 3128.6444 3142.2733 3153.1940 3166.6153 3196.0523 3526.0603
redmass: 6.1205 3.9527 3.5955 5.2885 3.1909 5.3057 4.0776 6.3790 2.9039 3.2671 2.8884 4.0814 1.8051 2.8732 2.8207 3.9733 3.8589 3.0188 6.1876 2.0367 3.2109 4.6841 4.1323 1.9628 2.8611 3.7141 2.3021 3.8658 1.2499 1.5197 2.2120 1.4335 2.1221 1.4808 3.4458 1.5654 1.4182 5.3315 1.3347 2.1625 1.8849 2.0369 1.6432 2.0550 1.4801 1.5205 1.0769 1.6519 1.1244 2.2306 1.2327 2.0383 1.9365 1.4204 1.7090 1.4485 1.4256 1.6327 2.6512 2.6417 2.2171 1.0946 1.0979 1.2661 1.7877 9.7061 5.7210 7.1971 6.0463 8.6129 1.0598 1.0717 1.0960 1.0632 1.1040 1.0865 1.0883 1.0854 1.0874 1.0924 1.0957 1.1014 1.0941 1.0648
irintensity: 0.9350 1.4009 0.4161 0.2395 3.1945 0.9585 0.1615 0.2031 0.7147 3.7707 4.2639 8.5277 11.4242 1.9314 8.4140 9.2426 0.9824 38.3608 23.2962 68.2689 3.4712 1.2431 2.0194 38.9515 29.3179 8.6789 44.7302 19.8935 0.8298 11.8702 94.4631 10.0017 7.9808 20.7750 60.5405 30.4876 1.0489 0.2121 0.5160 11.6493 12.0353 191.9455 19.4142 307.1564 1.7614 1.9646 1.8760 49.3419 0.4455 22.7928 13.0645 25.7662 45.0171 10.8619 33.5030 1.7592 11.0412 2.8548 3.7571 1.8185 9.5400 8.0105 8.6246 2.2760 32.0803 129.9984 5.4758 579.6254 16.6367 7.9618 57.8016 19.9136 19.2321 55.2271 45.8544 1.5188 20.8913 4.1272 0.0979 15.6003 42.3029 25.7244 0.3460 41.3155
temp: 298.150 k
press: 1.00000 atm
elementType: 8 8 6 6 6 6 6 6 6 6 6 6 6 6 6 6 1 1 1 1 1 1 1 1 1 1 1 1 1 1
symmnumber: 1
zpe: 634697.7 jmol-1
zpe.correction: 0.241744 hartree
zpe.thermalcorrener: 0.255863 hartree
zpe.thermalcorrenthalpy: 0.256808 hartree
zpe.thermalcorrgfe: 0.199372 hartree
zpe.sumelectzpe: -691.158590 hartree
zpe.sumelectthermal: -691.144470 hartree
zpe.sumelectthermalent: -691.143526 hartree
zpe.sumelectthermalfe: -691.200962 hartree
dipole: 0.7106 4.6888 0.8411
dipole: 4.8163
quadrupole: -83.6810 -92.2019 -97.0760
quadrupole: -13.0307 -1.4591 -2.8109
quadrupole: 7.3053 -1.2156 -6.0897 -13.0307 -1.4591 -2.8109
hfenergy: -691.400334 hartree
pointgroup: C01 [X(C14H14O2)]
dipole: -0.3294079 -1.8550405 -0.202212 debye
polarizability: 302.0017403|-3.1443712|140.4800772|-0.528566|22.9238225|89.0929095 unknown
InChI: InChI=1S/C14H14O2/c15-10-13-8-4-7-12(14(13)16)9-11-5-2-1-3-6-11/h1-3,5-6,9-10,15H,4,7-8H2
charge 0 multiplicity 1
30 atoms
O  1.756165 2.036797 0.395123
O  5.434609 0.132513 0.122309
C  1.616681 -2.059097 -0.584044
C  0.487258 -1.504993 0.313801
C  2.978447 -1.541074 -0.070569
C  0.414584 0.011617 0.232896
C  2.98386 -0.028358 0.138646
C  1.725421 0.76317 0.271566
C  -0.723133 0.779851 0.18879
C  -2.144124 0.392542 0.100582
C  4.161427 0.673101 0.216407
C  -2.626143 -0.714188 -0.659091
C  -3.104392 1.214611 0.761839
C  -4.005302 -1.003785 -0.722379
C  -4.481268 0.915468 0.713045
C  -4.939334 -0.199975 -0.0270
H  1.61075 -3.165122 -0.569678
H  1.455744 -1.737823 -1.630764
H  0.710433 -1.791369 1.364683
H  -0.4786 -1.971975 0.070832
H  3.773003 -1.842355 -0.788938
H  3.206434 -2.05465 0.888207
H  -0.533064 1.863136 0.257733
H  4.186164 1.755079 0.36263
H  -1.925493 -1.317788 -1.245023
H  -2.755165 2.087495 1.326503
H  -4.354171 -1.850448 -1.324418
H  -5.196927 1.555428 1.240982
H  -6.009544 -0.429454 -0.075281
H  5.407177 -0.849157 -0.023887
