program: Gaussian 09
title: 000271834
version: EM64L-G09RevD.01
frameworkgroup: C1[X(C16H22N2O2)]
method: RPBEPBE
basis: SDD
operation: Freq
keyword: #p
keyword: freq=noraman
keyword: PBEPBE/SDD
title: #p freq=noraman PBEPBE/SDD
converged: YES YES NO NO
title: Mulliken charges:
elementType: O O N N C C C C C C C C C C C C C C C C H H H H H H H H H H H H H H H H H H H H H H
charge: -0.313955 -0.251301 -0.124997 -0.448267 0.285242 -0.495776 0.072625 0.005237 0.224220 -0.303907 -0.308796 -0.378201 -0.362825 -0.683414 -0.691241 0.162806 -0.259523 -0.211025 -0.255003 -0.662541 0.251221 0.216930 0.204282 0.184037 0.226762 0.186301 0.333633 0.274044 0.234250 0.214184 0.222108 0.210157 0.204787 0.234540 0.209047 0.222966 0.221913 0.236493 0.220857 0.217055 0.223358 0.251716
chargesum: 0.00000
title: Mulliken charges with hydrogens summed into heavy atoms:
elementType: O O N N C C C C C C C C C C C C C C C C
charge: -0.313955 -0.251301 -0.124997 -0.114633 0.285242 -0.027626 0.072625 0.005237 0.224220 0.084412 0.104267 -0.104157 -0.128575 -0.036965 -0.042868 0.162806 -0.036557 0.010888 0.202348 0.029587
polarizability: 2.60045743e+02 2.72907205e+01 2.33844974e+02 -1.25438660e+01 3.97298760e+00 1.29888635e+02
1716.lowfreq: -10.3780 -0.0006 -0.0004 0.0005 4.8392 8.7051 16.8095 40.7595 41.1227
frequency: 14.5641 40.7364 41.0306 50.4436 57.2697 66.8039 85.5012 101.1438 110.4243 114.0704 161.8504 187.3628 194.7130 214.2962 235.8994 266.1267 268.1497 289.1834 293.0646 314.9762 340.8621 357.5067 382.3808 424.6572 436.3415 442.7180 474.2398 561.6746 566.8266 573.4483 603.2610 604.8885 632.3441 706.9912 721.2013 737.7050 751.2438 760.9844 767.0371 793.5270 798.0473 802.7998 818.6234 858.1656 862.6564 889.7005 923.3050 951.2133 983.1626 986.5776 991.8303 1006.8269 1021.0411 1045.8924 1063.0213 1073.6181 1085.0349 1095.2485 1108.3684 1120.9569 1152.8436 1153.9836 1162.5163 1170.8817 1198.6744 1226.1267 1245.9701 1262.6086 1280.3393 1284.2002 1286.6295 1312.0653 1343.6189 1356.7582 1360.3304 1361.8316 1375.5793 1386.6745 1389.1974 1389.6598 1411.7013 1422.2825 1449.1219 1458.0078 1463.4164 1463.7398 1466.6160 1469.0010 1473.7819 1478.5675 1484.1565 1484.9979 1488.6056 1489.9326 1550.7339 1576.4457 1627.4026 1631.9142 2849.2702 2862.6246 2915.5232 2981.8064 2982.2364 2991.8935 3004.6710 3028.0487 3030.5220 3037.8263 3072.7541 3075.5724 3086.3842 3087.2812 3089.7104 3091.2852 3116.8846 3125.9185 3139.1169 3155.5269 3169.9985 3607.6648
redmass: 2.9365 3.0286 3.5633 3.3478 2.7320 2.5054 6.8425 2.4179 3.6571 3.0993 3.4330 2.0980 1.4599 1.2351 1.5859 3.7660 2.5384 2.0281 3.8394 2.9123 4.0065 3.8752 5.3552 3.2596 2.8639 3.1924 2.8221 5.0879 3.9929 5.7598 5.3970 1.0971 5.4282 4.1650 5.3886 4.4292 2.6320 1.6484 3.1225 1.2297 1.6200 1.2925 2.0004 3.0947 1.5932 2.9469 2.5755 1.3661 1.9706 1.7454 1.7005 2.0763 2.8327 3.5187 3.3258 1.8953 2.1466 2.1598 1.9083 1.8113 1.8732 1.7149 1.6669 1.4983 2.3432 1.4761 2.0381 1.3013 1.1155 1.2284 1.2073 3.6955 2.1080 1.3112 1.3257 1.3489 1.4223 1.2288 1.2354 1.2325 3.4974 3.7620 4.3809 1.1077 1.0502 1.0565 1.0542 1.0609 1.0898 1.0893 1.0558 1.1445 2.4354 1.0720 8.0822 6.2427 8.1805 9.0030 1.0723 1.0714 1.0680 1.0358 1.0359 1.0361 1.0889 1.0591 1.0876 1.0872 1.0983 1.0977 1.0981 1.1003 1.1002 1.1031 1.1055 1.0853 1.0904 1.0962 1.0983 1.0806
irintensity: 0.0546 0.3914 0.7727 1.1265 0.5368 0.3397 0.8567 1.5663 0.2793 0.1195 0.7280 2.6093 0.6292 1.9240 0.3058 2.7664 0.5568 2.4730 2.1767 13.7105 1.3392 3.3653 4.1326 3.9791 2.2738 11.9176 4.6158 7.9053 1.3173 5.7176 3.9506 81.5882 3.4835 8.4813 7.3081 27.1714 20.6730 69.5269 10.3724 4.7358 25.4191 1.1384 4.7266 0.9789 0.1998 12.9116 48.4935 3.7597 13.1536 10.4268 21.8634 9.7428 95.2630 236.1597 93.3694 19.7672 4.7142 25.9080 13.8937 30.5586 26.1729 81.5181 20.3836 21.3097 43.4515 224.9805 25.0270 15.8827 1.8129 15.3174 17.7129 78.3308 40.0279 5.0110 7.2251 7.7407 2.5833 25.6056 20.9137 27.3243 8.1465 38.6029 16.7280 23.0440 14.3542 2.5519 8.4780 1.3994 3.6402 7.5015 14.1155 12.1879 1.9551 11.1024 71.0249 6.5270 107.7798 295.2341 50.8881 147.8612 29.7872 36.7853 24.6693 24.2139 15.0678 40.2063 8.5333 13.4004 32.7332 89.5239 38.1894 35.9353 46.8162 4.6053 32.1632 0.7414 16.0650 24.1347 23.0665 100.7143
temp: 298.150 k
press: 1.00000 atm
elementType: 8 8 7 7 6 6 6 6 6 6 6 6 6 6 6 6 6 6 6 6 1 1 1 1 1 1 1 1 1 1 1 1 1 1 1 1 1 1 1 1 1 1
symmnumber: 1
zpe: 923080.3 jmol-1
zpe.correction: 0.351583 hartree
zpe.thermalcorrener: 0.372425 hartree
zpe.thermalcorrenthalpy: 0.373369 hartree
zpe.thermalcorrgfe: 0.299897 hartree
zpe.sumelectzpe: -881.355036 hartree
zpe.sumelectthermal: -881.334193 hartree
zpe.sumelectthermalent: -881.333249 hartree
zpe.sumelectthermalfe: -881.406721 hartree
dipole: -1.8478 1.0929 0.5124
dipole: 2.2072
quadrupole: -100.6507 -114.9115 -121.6475
quadrupole: -5.9609 -2.5622 1.0861
quadrupole: 11.7526 -2.5083 -9.2442 -5.9609 -2.5622 1.0861
hfenergy: -881.7066184 hartree
pointgroup: C01 [X(C16H22N2O2)]
dipole: -0.6853106 0.4762023 0.2400778 debye
polarizability: 263.5975816|25.6420252|229.029369|-14.118828|8.9819948|131.1524027 unknown
InChI: InChI=1S/C16H22N2O2/c1-4-18(5-2)11-13-12-9-7-8-10-14(12)17-15(13)16(19)20-6-3/h7-10,17H,4-6,11H2,1-3H3
charge 0 multiplicity 1
42 atoms
O  -3.570761 0.163315 0.669962
O  -2.529472 -1.864677 0.100417
N  1.923156 -1.785478 0.064521
N  -1.356194 1.611058 0.391694
C  0.064269 -0.118345 -0.14499
C  0.578462 -1.489945 -0.51442
C  0.816356 1.118542 -0.11335
C  -1.267833 0.2220 0.171602
C  -0.101267 2.181699 0.22524
C  2.534417 -2.981529 -0.578175
C  1.868841 -1.901979 1.550591
C  2.187564 1.431558 -0.337365
C  0.313525 3.530054 0.33438
C  3.077044 -2.703439 -1.993627
C  3.240588 -1.688606 2.21781
C  -2.455375 -0.62253 0.288868
C  2.599951 2.770669 -0.233741
C  1.672588 3.808258 0.098774
C  -4.871072 -0.557393 0.795375
C  -5.586739 -0.62575 -0.557074
H  -0.17933 -2.256656 -0.231656
H  0.677905 -1.538999 -1.616347
H  3.375801 -3.308726 0.058458
H  1.809864 -3.835727 -0.612392
H  1.176032 -1.12174 1.915309
H  1.436132 -2.885711 1.865238
H  -2.229747 2.074084 0.635487
H  2.886463 0.621823 -0.565936
H  -0.390683 4.328572 0.592086
H  2.278099 -2.415639 -2.700703
H  3.817599 -1.884724 -1.963813
H  3.568084 -3.607457 -2.399874
H  3.977718 -2.456382 1.919451
H  3.643494 -0.699095 1.939789
H  3.14209 -1.732686 3.318603
H  3.650405 3.031535 -0.403759
H  2.03038 4.841495 0.174469
H  -4.673151 -1.567786 1.194144
H  -5.433071 0.038457 1.532855
H  -6.579786 -1.096179 -0.431291
H  -5.733767 0.383727 -0.978792
H  -5.007376 -1.231673 -1.273621
