program: Gaussian 09
title: 000271823
version: EM64L-G09RevD.01
frameworkgroup: C1[X(C11H12Cl2O2)]
method: RPBEPBE
basis: SDD
operation: Freq
keyword: #p
keyword: freq=noraman
keyword: PBEPBE/SDD
title: #p freq=noraman PBEPBE/SDD
converged: NO YES NO NO
title: Mulliken charges:
elementType: Cl Cl O O C C C C C C C C C C C H H H H H H H H H H H H
charge: -0.047905 -0.027749 -0.287815 -0.173060 0.300313 -0.326244 0.409738 0.271648 -0.703163 -0.302615 -0.288322 -0.811051 -0.277378 -0.079653 -0.513811 0.295416 0.229012 0.220713 0.231853 0.277569 0.218994 0.242795 0.282463 0.163271 0.212273 0.240992 0.241718
chargesum: 0.00000
title: Mulliken charges with hydrogens summed into heavy atoms:
elementType: Cl Cl O O C C C C C C C C C C C
charge: -0.047905 -0.027749 -0.287815 -0.173060 0.300313 -0.030829 0.409738 0.271648 -0.021585 -0.302615 -0.288322 -0.071693 0.005085 0.083618 0.181171
polarizability: 1.76342911e+02 6.74537336e+00 1.67574285e+02 -3.73352810e+00 5.56189888e+00 8.82436671e+01
1716.lowfreq: -10.5615 -4.4035 -2.2411 0.0022 0.0029 0.0029 54.6323 60.9243 76.0030
frequency: 54.6185 60.8950 75.9850 89.8797 103.7025 116.7985 137.2227 143.3384 164.1551 174.9403 182.7329 204.4702 220.2930 239.7925 277.1262 324.1301 333.3418 345.6419 378.7673 405.0520 433.7808 461.7704 534.9232 584.8667 611.1606 646.2742 653.9294 707.8846 762.4423 796.1424 858.4028 875.3255 905.6845 916.9061 986.4225 997.5396 1032.3712 1045.3311 1083.5097 1104.0180 1109.4606 1149.1886 1179.6382 1192.4391 1242.9773 1269.7866 1286.6853 1348.5766 1371.5391 1383.9843 1399.7752 1406.8345 1423.5544 1438.3135 1457.4773 1460.6665 1471.2130 1473.4147 1474.7267 1486.9170 1565.7523 1572.5975 1644.5612 2842.2574 2930.4962 2973.0078 2987.6256 2998.1996 3074.9021 3078.3839 3080.5106 3099.0126 3119.4175 3128.0302 3185.8693
redmass: 6.0274 4.7057 4.4589 2.0741 2.2703 1.6455 1.3698 3.0441 4.0323 1.9283 2.8541 2.7827 4.3859 2.9727 5.9484 3.9768 4.1275 9.9661 5.5285 3.8635 4.5682 5.1632 4.7879 4.4046 5.6804 4.7762 5.0203 5.7675 6.2694 6.2003 1.3962 4.0164 1.5417 1.9108 2.8939 1.7394 2.0150 2.2356 2.4039 2.2985 1.2775 1.3524 2.0846 1.6343 7.7988 1.9869 1.3478 5.1740 2.9113 1.2351 1.3636 1.2122 3.0395 1.2761 1.0544 1.1219 1.0655 1.0790 1.0557 1.0557 7.0234 9.2221 8.8515 1.0841 1.0785 1.0330 1.0371 1.0393 1.1015 1.0967 1.0974 1.1001 1.0970 1.1026 1.0935
irintensity: 2.0241 1.2576 0.5708 3.7241 5.7295 5.1126 0.9995 3.0503 0.2139 0.2288 2.3508 3.7569 1.9068 3.2257 4.0137 1.0018 3.7941 1.0015 9.1338 7.1882 3.8735 17.0277 3.0646 1.9989 2.8827 13.1753 15.0758 38.2008 5.3834 11.4100 20.2098 37.0435 6.2679 66.3343 10.3989 15.6202 34.9167 41.0326 11.6307 4.6492 7.4467 1.9174 34.3335 13.6140 29.3478 35.2080 14.8675 8.7394 33.7813 10.5074 19.8432 22.3710 62.7792 22.7193 7.6674 32.1448 13.7077 8.1897 11.4285 4.8192 8.3719 15.8556 132.2098 156.2229 41.7124 63.7115 37.3374 13.7401 32.3177 6.6370 32.0060 21.3125 19.9970 18.4841 1.0729
temp: 298.150 k
press: 1.00000 atm
elementType: 17 17 8 8 6 6 6 6 6 6 6 6 6 6 6 1 1 1 1 1 1 1 1 1 1 1 1
symmnumber: 1
zpe: 528386.7 jmol-1
zpe.correction: 0.201252 hartree
zpe.thermalcorrener: 0.217857 hartree
zpe.thermalcorrenthalpy: 0.218801 hartree
zpe.thermalcorrgfe: 0.156657 hartree
zpe.sumelectzpe: -1495.781590 hartree
zpe.sumelectthermal: -1495.764985 hartree
zpe.sumelectthermalent: -1495.764041 hartree
zpe.sumelectthermalfe: -1495.826185 hartree
dipole: -0.2715 -2.9867 -4.1174
dipole: 5.0938
quadrupole: -101.0264 -94.7251 -109.0603
quadrupole: -0.9683 -2.5701 6.9253
quadrupole: 0.5775 6.8788 -7.4564 -0.9683 -2.5701 6.9253
hfenergy: -1495.9828421 hartree
pointgroup: C01 [X(C11H12Cl2O2)]
dipole: -0.5548712 0.9771981 -1.6593673 debye
polarizability: 167.2070311|6.834953|176.3189643|6.712169|-5.4501505|88.6348677 unknown
InChI: InChI=1S/C11H12Cl2O2/c1-6(5-14)10-7(2)8(12)4-9(13)11(10)15-3/h4-6H,1-3H3
charge 0 multiplicity 1
27 atoms
Cl 0.989123 -3.743942 -0.218982
Cl 3.484524 1.138603 0.377942
O  0.612685 2.263402 0.139013
O  -2.65659 -0.207082 1.848237
C  -0.491208 0.107177 -0.150266
C  -1.799321 0.889979 -0.21211
C  -0.440332 -1.319235 -0.224259
C  0.710938 0.862814 -0.000539
C  -2.40958 0.991801 -1.640415
C  0.839694 -1.921598 -0.143078
C  1.953183 0.196165 0.096397
C  -1.675512 -2.186747 -0.359562
C  2.03623 -1.202793 0.021816
C  -2.850419 0.479796 0.821539
C  1.097026 3.067667 -1.007178
H  -1.54457 1.931986 0.089733
H  -1.71682 1.525147 -2.313564
H  -3.361538 1.555242 -1.620001
H  -2.606345 0.000349 -2.082111
H  -1.933593 -2.634654 0.61763
H  -2.554868 -1.62093 -0.698991
H  -1.498898 -3.014332 -1.067487
H  2.997322 -1.714886 0.10371
H  -3.8643 0.913117 0.605039
H  0.496823 2.851436 -1.912037
H  2.165197 2.873894 -1.206417
H  0.95855 4.115325 -0.701362
