program: Gaussian 09
title: 000271820
version: EM64L-G09RevD.01
frameworkgroup: C1[X(C14H9ClS2)]
method: RPBEPBE
basis: SDD
operation: Freq
keyword: #p
keyword: freq=noraman
keyword: PBEPBE/SDD
title: #p freq=noraman PBEPBE/SDD
converged: YES YES NO NO
title: Mulliken charges:
elementType: Cl S S C C C C C C C C C C C C C C H H H H H H H H H
charge: -0.181458 0.077988 0.031406 0.490389 0.507012 0.442752 0.441333 -0.707329 -0.736250 -0.377027 -0.392326 -0.429819 -0.429243 -0.236972 -0.234574 -0.242468 -0.243826 0.249496 0.270855 0.262009 0.247930 0.248401 0.236450 0.234000 0.235522 0.235748
chargesum: 0.00000
title: Mulliken charges with hydrogens summed into heavy atoms:
elementType: Cl S S C C C C C C C C C C C C C C
charge: -0.181458 0.077988 0.031406 0.490389 0.507012 0.442752 0.441333 -0.707329 -0.486754 -0.106172 -0.130317 -0.181889 -0.180842 -0.000521 -0.000574 -0.006946 -0.008078
polarizability: 3.14656575e+02 2.27551972e+01 2.76567857e+02 3.53982692e+00 -4.24788012e+00 1.04019062e+02
1716.lowfreq: -5.5925 0.0024 0.0026 0.0028 5.3907 10.1013 20.5985 44.1678 69.8604
frequency: 20.4593 44.1326 69.8121 88.7602 109.7140 114.9645 164.3032 232.6253 235.1953 244.1871 298.2720 354.7584 373.9216 379.5688 399.6294 403.9797 411.1983 471.5580 501.8228 546.8991 547.4819 606.6421 606.9764 639.5651 660.3766 754.6819 759.0210 773.8434 808.5244 817.4910 838.3596 874.6145 879.5067 911.4637 914.4792 945.7735 970.6568 979.2518 997.6882 998.9730 1024.0335 1025.9157 1104.7613 1151.4724 1171.8779 1180.9348 1199.6549 1250.6622 1258.0675 1274.5654 1297.8772 1355.8703 1387.4388 1410.1368 1426.5674 1443.4794 1444.4358 1482.3451 1531.1077 1553.5095 1578.3645 1623.5650 1631.1572 3121.6133 3127.5033 3128.1332 3139.8946 3141.5107 3157.3421 3158.2481 3170.3459 3171.2013
redmass: 11.8136 9.5585 6.5202 8.2678 8.9771 4.1384 8.0669 5.3624 5.1786 11.0019 4.3638 10.4211 10.0431 16.7358 6.8583 5.4587 4.3533 2.8658 3.3801 3.2326 5.6273 5.5557 4.4890 6.2284 6.4428 1.2539 3.2557 1.3304 6.2619 2.0745 4.8091 1.5436 1.5731 6.3195 6.8114 1.9274 1.3626 1.4746 1.3553 1.3580 2.3855 2.1556 2.2122 1.4831 1.1111 1.0692 1.2744 1.6048 3.4552 2.0025 2.2354 2.6777 1.9239 4.1958 9.6718 2.4482 2.7176 2.6855 6.3199 7.5725 5.4217 6.3536 6.1700 1.0913 1.0868 1.0868 1.0891 1.0891 1.0945 1.0947 1.0998 1.0997
irintensity: 0.2052 1.5633 0.1609 1.8034 1.8160 0.3609 2.0765 0.8764 0.0858 0.2867 3.6480 6.4029 6.3953 44.7736 8.2421 0.0756 9.3188 0.5204 0.0968 11.8102 2.2503 7.2871 8.7627 0.0542 3.8057 113.1328 2.2847 0.6827 7.6695 15.0037 0.4164 27.7576 0.9860 0.2114 2.0279 16.2793 0.2773 11.1585 1.5893 0.5693 3.0530 9.6630 0.4334 14.3347 2.8132 0.3383 5.2537 4.0927 8.0020 28.5190 1.9686 0.5992 0.1921 2.7159 1.0723 18.8837 26.0820 11.9706 11.4834 18.5235 0.1059 10.3332 1.5103 4.3877 0.0557 4.5068 8.7975 11.8536 13.9694 22.7156 49.6930 1.6581
temp: 298.150 k
press: 1.00000 atm
elementType: 17 16 16 6 6 6 6 6 6 6 6 6 6 6 6 6 6 1 1 1 1 1 1 1 1 1
symmnumber: 1
zpe: 483738.3 jmol-1
zpe.correction: 0.184246 hartree
zpe.thermalcorrener: 0.198911 hartree
zpe.thermalcorrenthalpy: 0.199855 hartree
zpe.thermalcorrgfe: 0.140350 hartree
zpe.sumelectzpe: -1793.924332 hartree
zpe.sumelectthermal: -1793.909667 hartree
zpe.sumelectthermalent: -1793.908723 hartree
zpe.sumelectthermalfe: -1793.968228 hartree
dipole: -4.4343 2.2913 0.1784
dipole: 4.9945
quadrupole: -114.3938 -103.8490 -125.3713
quadrupole: 8.0309 7.3425 -3.2307
quadrupole: 0.1442 10.6891 -10.8333 8.0309 7.3425 -3.2307
hfenergy: -1794.1085783 hartree
pointgroup: C01 [X(C14H9Cl1S2)]
dipole: 0.8650554 -1.7513556 0.2134134 debye
dipolederiv: -0.6216434 0.5167105 -0.3705106 0.014664 -0.2767407 0.0268369 -0.1451528 0.2467083 -0.2836159 -0.0374117 -0.1635158 0.0094034 -0.1622017 0.8392396 0.03324 -0.1539095 0.0642322 -0.0274993 0.4713459 -0.3656839 0.3644883 0.027065 -0.2552412 -0.1839714 0.1901549 0.0607761 0.2257897 0.0517957 0.4851528 -0.0304633 -0.1307452 -0.0689182 -0.0581039 -0.010736 -0.0506905 0.0600844 0.2643473 -0.4101564 0.0511633 0.2204653 -0.1939684 -0.0534549 0.021344 0.0824248 0.031522 -0.174637 0.1755919 0.0156637 0.2167088 -0.1314058 -0.0475287 0.0792058 -0.0938293 0.0376697 -0.0436481 -0.1473748 0.0076954 -0.1265778 -0.2768537 -0.0338203 -0.0346231 -0.0871112 0.0406863 -0.0509702 0.046263 -0.0292952 0.0535462 -0.3227752 0.1477498 0.0974561 -0.4501936 -0.1744513 0.2535238 0.0303229 -0.0355437 0.0246211 0.1656267 0.106945 -0.0289371 0.0966678 -0.1169886 -0.0959918 -0.3082386 0.0278119 -0.1038885 -0.0105428 0.0436715 -0.0127411 0.0008278 -0.1056443 -0.2552259 0.1839825 -0.0273377 0.0193772 0.1166887 0.0381127 0.0172632 0.04495 -0.1221084 0.0427085 -0.1569183 -0.0128206 0.0805151 0.108548 0.0666713 0.0053239 0.0931935 -0.1463467 0.0382452 0.102198 -0.0186275 -0.1070869 0.1195847 0.0761301 -0.0513705 0.0656203 -0.1390456 0.0912733 -0.0767326 -0.056126 -0.153894 0.1981642 0.0437819 -0.0301119 0.0756081 -0.1150856 0.0272441 0.0399508 0.0239059 0.0722876 0.2449299 0.0635406 0.0036796 0.0981638 -0.1204105 -0.0894032 0.227746 0.0307405 0.1654073 -0.0250176 0.0588437 0.0453395 0.0311585 -0.1396599 0.0311798 -0.1856775 -0.0603283 -0.1284115 -0.1442322 0.0462752 -0.0613407 0.0246028 -0.1357862 0.0634229 0.0223324 0.013234 0.0233242 -0.0595984 -0.0574451 0.0133689 -0.0505328 0.1257107 0.0733061 -0.0014834 -0.0299888 0.0533443 -0.0207735 -0.0372649 -0.0171105 0.0315089 0.1146286 0.1233239 0.0382601 0.0458768 -0.0227168 -0.021397 -0.0409093 0.0009671 -0.0257374 0.1212624 0.0688392 0.0735989 0.0265696 -0.0114849 -0.0742251 -0.0587092 0.0030402 -0.0730701 0.1372469 0.0712908 -0.022291 0.0020304 0.0670752 -0.0743921 -0.068166 0.0318838 -0.0713552 0.1366005 -0.093392 0.0307889 0.0388806 0.0618395 0.0756584 -0.0231997 0.0228975 -0.0262521 0.1453034 -0.0540551 -0.0879523 -0.0135324 -0.1112569 0.019018 -0.0326433 -0.0122288 -0.0272641 0.1464458 -0.0409698 -0.1200068 -0.0133255 -0.1084122 -0.0038006 -0.0287048 -0.0211086 -0.0300037 0.1532541 -0.1144983 0.0731326 0.0404357 0.0664357 0.0724243 -0.027877 0.0474463 -0.0304029 0.1504377 unknown
polarizability: 322.6811422|-11.1700817|268.2449995|8.6658265|-5.2396975|104.3173527 unknown
InChI: InChI=1S/C14H9ClS2/c15-17-16-14-12-7-3-1-5-10(12)9-11-6-2-4-8-13(11)14/h1-9H
charge 0 multiplicity 1
26 atoms
Cl -2.694105 3.722971 -1.297532
S  -0.311218 2.369513 1.173214
S  -0.467966 3.698147 -0.659303
C  -1.115428 -0.193591 0.338748
C  1.345548 0.273344 0.261366
C  -0.853319 -1.568741 -0.078362
C  1.576877 -1.10484 -0.165054
C  -0.002342 0.69213 0.515665
C  0.478029 -1.982482 -0.315505
C  -2.48481 0.204012 0.532069
C  2.489969 1.134483 0.402786
C  -1.956972 -2.477838 -0.252304
C  2.922271 -1.548731 -0.426468
C  -3.526579 -0.703132 0.353257
C  3.776438 0.671018 0.13719
C  -3.265335 -2.059643 -0.038636
C  4.0006 -0.683969 -0.282315
H  0.664326 -3.016153 -0.633805
H  -2.702294 1.238805 0.811969
H  2.337983 2.167458 0.728205
H  -1.742892 -3.507473 -0.56181
H  3.077626 -2.586441 -0.744043
H  -4.561145 -0.376963 0.504247
H  4.631272 1.346754 0.249351
H  -4.100579 -2.754662 -0.174218
H  5.020447 -1.026977 -0.485311
