program: Gaussian 09
title: 000271813
version: EM64L-G09RevD.01
frameworkgroup: C1[X(C10H10ClNO2)]
method: RPBEPBE
basis: SDD
operation: Freq
keyword: #p
keyword: freq=noraman
keyword: PBEPBE/SDD
title: #p freq=noraman PBEPBE/SDD
converged: YES YES NO NO
title: Mulliken charges:
elementType: Cl O O N C C C C C C C C C C H H H H H H H H H H
charge: -0.077386 -0.193841 -0.210629 0.019061 0.439706 -0.632667 0.209687 -0.386150 -0.152185 -0.353324 -0.225410 -0.220405 -0.068250 -0.676110 0.217422 0.269300 0.242833 0.240346 0.282951 0.238986 0.243986 0.264196 0.258173 0.269712
chargesum: 0.00000
title: Mulliken charges with hydrogens summed into heavy atoms:
elementType: Cl O O N C C C C C C C C C C
charge: -0.077386 -0.193841 -0.210629 0.019061 0.439706 -0.145945 0.209687 -0.143317 0.088161 -0.070373 0.013576 0.023580 0.195945 -0.148225
polarizability: 1.67131973e+02 -1.83417263e+01 1.38714223e+02 -2.53398638e+01 -8.84951688e+00 9.35012306e+01
1716.lowfreq: -9.5104 -5.9966 -0.0016 0.0011 0.0017 5.0192 19.4593 25.7125 52.8850
frequency: 18.6210 25.6970 52.8734 70.4872 99.2380 129.6726 169.0605 227.2515 265.9696 286.7271 323.8541 355.6014 379.9730 422.2082 458.8109 526.3014 547.4558 572.3443 611.0151 651.1253 671.1572 739.4975 760.4899 784.6646 816.1849 851.3661 870.7299 892.8954 924.4660 971.4791 976.8924 999.6448 1039.5938 1054.3962 1068.3222 1095.3014 1123.4874 1150.3857 1176.4702 1192.7657 1203.2288 1214.4735 1241.0981 1272.2174 1295.6393 1300.7495 1330.1762 1370.5066 1385.4661 1434.7646 1454.7112 1459.2577 1473.4109 1580.5206 1607.3622 1670.3953 2994.6887 3056.9178 3080.5673 3102.7114 3127.5768 3131.6093 3146.5571 3149.6214 3166.6104 3185.3243
redmass: 8.0929 12.0670 14.5949 3.5327 5.4094 3.9513 3.0324 3.7880 5.3852 5.1140 4.3183 2.6721 7.3953 3.5719 3.6644 3.1900 3.9893 4.0232 6.1509 6.9808 5.2692 3.1107 5.6509 1.5402 3.9001 1.8570 1.7091 1.5190 1.7586 1.3771 1.1272 1.3477 3.0839 2.4895 2.5163 2.4119 1.5396 1.4580 1.1067 1.8406 1.6932 7.6328 1.1611 1.2924 1.3213 1.3011 1.3459 6.4587 6.5853 2.4111 1.1270 1.2612 1.9896 6.3655 6.8386 6.1946 1.0670 1.0569 1.0902 1.0943 1.0974 1.0878 1.1048 1.0907 1.0955 1.0975
irintensity: 0.7033 0.3469 0.2449 3.5573 1.3112 0.7851 1.5791 1.7857 1.6876 1.0332 10.6127 0.8099 1.8588 0.6276 10.0683 1.6176 5.7185 4.8714 47.6044 14.9386 17.4790 16.6093 8.3635 51.5510 7.1993 4.4339 5.2480 1.7212 1.9133 6.1614 57.6615 0.8117 5.7379 1.4715 17.4627 3.6147 12.7579 14.0099 5.5215 17.5754 0.3365 166.8679 17.9990 2.0164 1.6942 3.9242 3.9061 132.1977 4.4830 16.9676 8.6096 28.0189 14.8465 11.5417 14.2663 13.4332 29.0116 24.3545 11.4877 5.2548 4.0146 4.4893 12.4905 11.7927 13.4762 7.7917
temp: 298.150 k
press: 1.00000 atm
elementType: 17 8 8 7 6 6 6 6 6 6 6 6 6 6 1 1 1 1 1 1 1 1 1 1
symmnumber: 1
zpe: 471272.7 jmol-1
zpe.correction: 0.179498 hartree
zpe.thermalcorrener: 0.192822 hartree
zpe.thermalcorrenthalpy: 0.193766 hartree
zpe.thermalcorrgfe: 0.136448 hartree
zpe.sumelectzpe: -1051.198831 hartree
zpe.sumelectthermal: -1051.185507 hartree
zpe.sumelectthermalent: -1051.184563 hartree
zpe.sumelectthermalfe: -1051.241881 hartree
dipole: 4.0837 -5.2090 -0.7204
dipole: 6.6580
quadrupole: -80.4148 -88.0181 -90.3682
quadrupole: 5.9864 -7.7022 -1.1233
quadrupole: 5.8522 -1.7510 -4.1012 5.9864 -7.7022 -1.1233
hfenergy: -1051.3783294 hartree
pointgroup: C01 [X(C10H10Cl1N1O2)]
dipole: -1.318581 2.2384149 0.3353864 debye
dipolederiv: -0.344553 0.0585515 0.074692 0.2897041 -0.4153248 -0.2476822 0.3476911 -0.2092373 -0.4156063 -0.3025697 0.0825583 -0.0843697 0.0409708 -0.7375667 -0.2095245 -0.1364121 -0.195959 -0.4425045 -0.5187284 0.0902616 -0.2771044 0.0945468 -0.4491359 0.0242675 -0.3084812 -0.0645397 -0.5798765 0.6918645 -0.4584252 0.4242652 -0.3588986 1.1924412 0.1553839 0.4586883 0.2055237 0.8167313 0.3525813 0.1014648 0.1165012 -0.1359594 0.1019935 -0.0437708 0.1650634 0.0847497 -0.0405584 -0.1851848 0.0002725 0.0129421 0.072583 0.1394334 0.0419537 0.0546467 0.1054397 0.0808081 -0.1864419 0.2831505 -0.0764022 0.2281555 -0.2797306 0.0323458 -0.0689769 0.0579504 -0.0266764 -0.3456585 0.0303607 -0.0385323 0.0861214 0.0847397 0.1109866 -0.0743596 0.075465 -0.1440625 0.1999682 -0.0930138 -0.1153998 -0.0996157 -0.0389264 -0.1529431 -0.2968028 -0.2304919 -0.0402366 -0.0084274 -0.1844225 -0.0001109 0.0012253 0.030574 0.0418445 0.0772654 -0.1201997 -0.0581798 0.1055002 -0.0691921 0.0786547 -0.0561354 0.1405747 0.024694 0.0788855 0.0270605 -0.0552527 0.0323572 0.084195 0.1411751 0.0264968 -0.242545 0.0110113 0.1263817 0.0215953 -0.0683223 -0.343026 -0.0355263 0.0112827 -0.1322514 -0.113716 -0.1893112 -0.0062636 -0.0994638 -0.0417501 0.4497564 -0.1175483 -0.0929953 -0.1578239 0.5194941 0.3046986 -0.3836855 0.3265455 0.4726872 0.0006494 0.0701379 0.0567198 -0.0065376 -0.0973051 -0.1213062 0.0603248 -0.053261 0.0529572 0.040164 0.0085138 -0.0475508 0.0183009 0.0837484 0.1106297 -0.0075035 0.0360164 0.0305201 0.0952078 -0.05611 -0.0541306 -0.0273093 -0.0581059 -0.0595615 -0.0236587 -0.0822507 0.1010328 0.0599084 0.0314971 0.0251657 0.0238381 0.0298949 0.1140993 0.082367 0.1160401 -0.0218318 0.1304865 0.0034912 -0.0084431 -0.0256734 0.0374312 -0.0380988 -0.0482568 -0.0229623 0.1384574 0.0162768 0.0963616 -0.0418931 0.1097657 -0.0090577 0.0144858 -0.0526415 0.0124632 0.1336549 -0.0311552 -0.0115782 -0.104352 -0.0232043 0.0831789 -0.0300907 -0.1113315 -0.018885 0.0951865 0.1013071 0.0234677 0.061853 0.0023101 0.0665942 0.1119175 0.0537467 0.0876752 0.0253394 0.088412 0.0659991 -0.0185612 -0.0096267 -0.1000499 0.054795 0.0410685 0.0207177 -0.0138839 -0.098695 -0.004467 -0.043406 0.0390172 0.0313658 -0.0608242 -0.0277552 -0.079992 0.001367 unknown
polarizability: 165.0390867|-25.3267478|138.5650149|15.5034015|18.1981908|95.7433249 unknown
InChI: InChI=1S/C10H10ClNO2/c11-8-4-3-6-9-5-1-2-7-10(9)12(13)14/h1-5,7H,6,8H2
charge 0 multiplicity 1
24 atoms
Cl 4.024012 -0.888463 -1.662981
O  -0.407898 -2.634428 -0.538962
O  0.498397 -1.644042 1.293805
N  -0.299699 -1.642692 0.27905
C  -0.859767 0.836282 0.554982
C  0.435104 1.207623 1.279559
C  -1.175794 -0.457896 0.04736
C  -1.805187 1.860177 0.285332
C  1.609762 1.282802 0.315255
C  -2.355387 -0.715351 -0.690518
C  -2.99453 1.620166 -0.435766
C  -3.271438 0.325046 -0.930416
C  2.735415 0.524006 0.403888
C  3.884727 0.663252 -0.537576
H  0.287622 2.203491 1.740745
H  0.658801 0.487918 2.080694
H  -1.593174 2.869822 0.655488
H  1.514824 2.013695 -0.503029
H  -2.531225 -1.728329 -1.061878
H  -3.69928 2.439788 -0.611632
H  -4.18896 0.126934 -1.493048
H  2.82324 -0.235362 1.191021
H  3.776183 1.508181 -1.233432
H  4.860552 0.692878 -0.03084
