program: Gaussian 09
title: 000271861
version: EM64L-G09RevD.01
frameworkgroup: C1[X(C22H12Cl4O5)]
method: RPBEPBE
basis: SDD
operation: Freq
keyword: #p
keyword: freq=noraman
keyword: PBEPBE/SDD
title: #p freq=noraman PBEPBE/SDD
converged: YES YES NO NO
title: Mulliken charges:
elementType: Cl Cl Cl Cl O O O O O C C C C C C C C C C C C C C C C C C C C C C H H H H H H H H H H H H
charge: 0.055730 0.052811 0.061582 0.068040 -0.272860 -0.279247 -0.186983 -0.395926 -0.219139 0.363170 0.298761 0.339689 -0.402413 -0.387496 -0.343042 -0.355947 0.363433 0.178909 -0.361317 0.469061 -0.379435 -0.385273 -0.383731 0.138163 -0.338022 -0.102705 -0.099297 -0.233788 -0.234403 -0.232568 0.045878 0.247684 0.249475 0.242841 0.279179 0.258271 0.277413 0.240712 0.239828 0.233153 0.232984 0.236851 0.419973
chargesum: 0.00000
title: Mulliken charges with hydrogens summed into heavy atoms:
elementType: Cl Cl Cl Cl O O O O O C C C C C C C C C C C C C C C C C C C C C C
charge: 0.055730 0.052811 0.061582 0.068040 -0.272860 -0.279247 -0.186983 0.024048 -0.219139 0.363170 0.298761 0.339689 -0.154729 -0.138021 -0.100201 -0.076768 0.363433 0.178909 0.174367 0.469061 -0.379435 -0.144561 -0.143903 0.138163 -0.338022 -0.102705 -0.099297 -0.000634 -0.001419 0.004282 0.045878
polarizability: 5.66755621e+02 1.45772134e+01 2.90663603e+02 1.69825210e+01 2.30251897e+01 1.49249575e+02
1716.lowfreq: -9.9003 -3.2429 -0.5308 -0.0025 -0.0023 -0.0021 9.7913 16.6061 29.4181
frequency: 9.7556 16.0369 29.4107 37.1868 48.1919 55.7948 60.9713 70.4237 78.0106 81.2743 99.8443 108.9080 111.9090 143.2981 146.2900 168.0485 183.8263 199.9040 205.0715 215.0766 217.5371 237.7247 253.4076 271.9272 284.5183 289.7101 296.8951 309.7191 329.0806 346.9598 369.8988 389.0742 401.0355 406.0013 418.8664 434.2476 469.8626 509.6799 529.0287 541.3033 571.6002 582.2828 605.9264 612.4678 615.7107 629.6177 633.3183 652.8899 685.4583 695.9931 700.0127 713.6785 735.9603 748.3269 758.2402 773.5634 788.6561 810.9520 812.8216 835.6343 850.4623 860.3112 862.3742 872.3389 925.9625 940.5392 962.0490 976.9866 980.5282 988.5826 994.7475 999.8867 1001.9898 1009.5703 1023.3430 1040.0832 1055.4857 1087.8797 1109.7594 1130.3366 1176.8948 1179.2697 1193.8479 1205.7617 1215.6071 1220.7862 1254.6091 1294.0651 1308.2074 1316.8469 1333.7455 1335.4475 1342.4587 1358.3013 1363.6554 1379.1014 1404.4384 1425.9229 1438.5026 1443.7884 1477.2811 1515.9269 1519.4265 1546.7186 1557.6665 1578.6255 1587.4941 1610.6406 1614.8105 1621.3431 1646.4337 2987.7377 2992.7411 3051.5268 3129.0462 3132.2033 3136.4143 3143.5771 3146.3695 3154.5500 3159.0701 3168.6824 3170.2742
redmass: 9.3747 4.1586 9.7249 8.9438 9.2860 9.1909 7.1303 6.3174 13.0841 5.3528 8.7559 8.2961 5.8946 8.6594 9.7788 6.5232 7.8727 21.5272 20.4186 8.7472 12.2609 8.0104 10.9358 10.2132 10.0291 6.2629 11.9432 8.4538 20.9512 18.8104 10.4341 4.4738 2.8343 2.8665 7.4688 9.2657 4.2159 5.8852 3.2028 10.4707 5.3334 3.1221 11.0218 6.5359 9.7470 6.6791 6.9206 10.7152 8.3532 7.5206 1.7620 7.0999 3.0128 2.6577 6.9854 1.9072 2.3290 8.6780 6.5336 1.4117 1.2569 4.1262 1.7795 8.0552 1.4417 8.4374 1.6154 1.4820 1.8054 4.3935 6.0150 1.3297 1.4588 4.2055 3.4064 1.9618 5.7097 1.6287 7.4262 1.3929 1.0557 4.9909 1.1172 1.1865 1.1416 5.3649 2.6087 2.8409 1.4251 1.4132 5.4587 4.9255 2.4003 4.1161 2.6557 9.3646 2.3887 4.2775 2.3826 1.1088 2.1187 2.7659 11.9600 6.3121 11.9325 6.7395 6.6039 6.0360 9.5106 6.5912 12.1877 1.0607 1.0629 1.1020 1.0851 1.0877 1.0877 1.0905 1.0899 1.0963 1.0958 1.0972 1.1010
irintensity: 0.1650 0.1818 0.1685 0.5982 1.0170 0.3405 2.0298 0.6697 0.2493 0.7359 2.3431 0.2343 7.0333 11.0424 1.3842 12.5003 14.1478 0.6272 2.7315 11.0766 2.6658 8.0666 13.9433 1.8215 0.2242 0.6895 3.0163 26.3961 3.4850 5.2539 1.7399 9.2419 0.1977 1.8055 2.5679 5.6812 27.7270 66.8077 3.0835 26.0683 20.4886 21.2753 20.3747 0.0960 13.9643 18.7977 0.1327 44.4335 4.9795 38.7806 45.3027 3.6090 24.0083 151.0334 49.9457 65.1095 155.3528 23.8647 8.7774 15.4571 0.9450 21.6439 13.0059 13.1595 3.2233 122.1933 0.8731 1.6569 0.1351 0.1023 25.9618 0.0269 0.7151 27.0363 132.5748 4.3686 64.5061 7.8552 596.3757 10.1826 0.5526 223.3368 1.7865 136.1718 26.6693 380.0659 164.6173 17.6836 1.5856 1.6038 25.5285 39.0369 130.1247 45.4754 48.3649 3.3187 281.9172 21.8581 9.4662 21.7045 2.5281 3.6231 31.6298 199.5197 31.8346 352.0665 83.5407 19.5334 232.6963 80.9343 170.8001 696.1197 1832.1255 2.9531 6.4337 1.0531 14.6122 8.7655 2.2426 25.6283 15.5185 1.4773 29.8546
temp: 298.150 k
press: 1.00000 atm
elementType: 17 17 17 17 8 8 8 8 8 6 6 6 6 6 6 6 6 6 6 6 6 6 6 6 6 6 6 6 6 6 6 1 1 1 1 1 1 1 1 1 1 1 1
symmnumber: 1
zpe: 740798.6 jmol-1
zpe.correction: 0.282155 hartree
zpe.thermalcorrener: 0.310271 hartree
zpe.thermalcorrenthalpy: 0.311215 hartree
zpe.thermalcorrgfe: 0.219063 hartree
zpe.sumelectzpe: -3059.735503 hartree
zpe.sumelectthermal: -3059.707388 hartree
zpe.sumelectthermalent: -3059.706444 hartree
zpe.sumelectthermalfe: -3059.798596 hartree
dipole: 9.0725 1.9171 -1.6845
dipole: 9.4246
quadrupole: -151.6774 -207.4118 -211.0915
quadrupole: 2.2757 1.0281 4.2368
quadrupole: 38.3828 -17.3516 -21.0313 2.2757 1.0281 4.2368
hfenergy: -3060.0176584 hartree
pointgroup: C01 [X(C22H12Cl4O5)]
dipole: -3.6033671 -0.8226819 0.2960078 debye
polarizability: 566.4567394|-20.5549702|162.2295101|-17.5610278|-45.3159913|277.9825499 unknown
InChI: InChI=1S/C22H12Cl4O5/c23-17-15(21(28)29)16(18(24)20(26)19(17)25)22(30)31-10-14(27)13-8-6-12(7-9-13)11-4-2-1-3-5-11/h1-9,28H,10H2
charge 0 multiplicity 1
43 atoms
Cl 4.761988 -1.915379 2.848617
Cl 5.580208 1.647172 -2.433898
Cl 7.690333 -1.530127 1.625305
Cl 8.115686 0.24026 -1.018242
O  1.541466 -0.566372 0.353345
O  -0.164874 0.277851 -1.609839
O  2.184055 -0.221669 2.570177
O  2.395077 0.50886 -2.124598
O  2.301771 2.168828 -0.489625
C  -5.029711 0.11501 -0.122626
C  -2.172779 0.004762 -0.333693
C  -6.512456 0.170693 -0.012895
C  -4.221611 -0.222879 1.001362
C  -4.3712 0.399222 -1.355469
C  -2.821492 -0.278863 0.902155
C  -2.973873 0.346781 -1.459881
C  3.868771 -0.261949 0.771514
C  -0.69655 -0.025094 -0.496487
C  0.133382 -0.418533 0.733921
C  4.066581 0.50223 -0.415181
C  4.983774 -0.881625 1.388717
C  -7.338908 -0.156549 -1.124636
C  -7.141243 0.554208 1.205151
C  2.491099 -0.347173 1.36945
C  5.35809 0.648447 -0.949398
C  6.281015 -0.735664 0.842333
C  6.471311 0.0381 -0.328053
C  -8.74437 -0.104563 -1.021267
C  -8.546565 0.610567 1.307422
C  -9.355405 0.28026 0.195005
C  2.852392 1.177831 -1.025934
H  -4.700538 -0.474552 1.953176
H  -4.963142 0.695753 -2.227459
H  -2.244675 -0.548116 1.793434
H  -2.469744 0.579341 -2.403144
H  -0.226921 -1.377673 1.149378
H  0.0396 0.351088 1.525507
H  -6.881134 -0.486201 -2.06401
H  -6.528395 0.8453 2.065607
H  -9.362761 -0.371339 -1.885152
H  -9.010657 0.92043 2.249992
H  -10.447023 0.322811 0.274613
H  1.369827 0.531416 -2.131793
