program: Gaussian 09
title: 000271819
version: EM64L-G09RevD.01
frameworkgroup: C1[X(C17H19NO)]
method: RPBEPBE
basis: SDD
operation: Freq
keyword: #p
keyword: freq=noraman
keyword: PBEPBE/SDD
title: #p freq=noraman PBEPBE/SDD
converged: YES YES NO NO
title: Mulliken charges:
elementType: O N C C C C C C C C C C C C C C C C C H H H H H H H H H H H H H H H H H H H
charge: -0.226885 -0.072629 -0.144873 -0.451107 -0.401138 -0.520426 0.071905 -0.705364 0.218759 0.313980 -0.396374 -0.363002 -0.344950 -0.257930 -0.230862 -0.176803 -0.230245 -0.351761 -0.185123 0.249541 0.206831 0.249611 0.197120 0.225782 0.239570 0.210891 0.230967 0.214912 0.209192 0.305534 0.273730 0.241837 0.228426 0.229749 0.239449 0.229118 0.239060 0.233508
chargesum: 0.00000
title: Mulliken charges with hydrogens summed into heavy atoms:
elementType: O N C C C C C C C C C C C C C C C C C
charge: -0.226885 -0.072629 0.104667 0.005336 0.021764 -0.069965 0.071905 -0.050293 0.218759 0.313980 -0.090841 -0.089272 -0.103113 -0.029505 -0.001114 0.062646 -0.001126 -0.112701 0.048385
polarizability: 2.30683462e+02 -1.02636210e+01 1.93591694e+02 -1.05270964e+01 -2.80148109e+01 1.36225787e+02
1716.lowfreq: -2.5952 -0.0003 0.0003 0.0006 2.3209 8.3207 24.0668 27.0926 46.4043
frequency: 23.5560 26.9930 46.3909 57.2053 61.2347 94.9227 108.4064 120.4980 154.9632 177.1462 184.0234 235.6587 286.2160 299.4067 322.6949 347.1859 388.6325 404.2430 406.2140 417.7796 437.3074 485.4375 508.4720 573.9735 612.3153 622.8952 637.3194 694.3885 710.7392 712.3612 751.4087 767.2051 779.2078 800.7116 815.1450 840.8024 872.2341 897.1201 907.1715 944.7667 954.6537 959.9985 964.9500 976.7859 986.3468 1000.4792 1001.5798 1004.7623 1020.9416 1030.6300 1041.6067 1049.2055 1075.4225 1079.0895 1086.2199 1098.4773 1112.7037 1158.5747 1165.8027 1171.5234 1197.6675 1199.2743 1231.5780 1237.6038 1259.3324 1281.1166 1295.2632 1312.9512 1318.1057 1322.4181 1334.2812 1341.8210 1365.2414 1385.2860 1395.3714 1414.4646 1434.3962 1453.8921 1457.6551 1468.8641 1469.2819 1477.4735 1483.8168 1485.4341 1558.7544 1563.4201 1583.5751 1591.9296 1608.4618 2975.1383 2976.8009 2981.4030 3000.0301 3028.2830 3037.4533 3052.6452 3060.7889 3072.1449 3076.2108 3097.4149 3125.1127 3125.6455 3135.8809 3138.3816 3151.9283 3152.8959 3164.1396 3171.0383
redmass: 4.6843 4.2972 4.4668 3.9735 3.6949 2.5534 5.1130 4.1926 3.6508 2.5986 3.8193 1.4895 2.7336 2.9737 3.9751 2.5501 3.3584 3.1513 2.9142 3.0631 3.6160 4.3014 3.8607 2.8360 6.3873 6.4960 3.7651 3.9821 2.2585 1.8371 1.6994 2.6596 1.7608 2.3997 1.8838 2.1652 1.2528 1.3175 1.8982 2.3563 2.0921 1.6424 2.0927 3.7621 5.0706 1.3735 1.4029 2.1253 1.3598 2.0160 2.4231 2.3709 2.8956 1.6479 1.7777 1.7553 1.8271 1.1869 1.0736 1.0652 1.4386 1.1886 2.5567 2.1204 1.3537 1.2094 2.1239 1.5770 1.8895 1.4700 1.3709 1.3893 1.4504 7.9607 1.2132 1.9375 2.2554 1.3866 1.3755 1.1854 1.1345 1.0491 1.1545 1.7551 6.7245 5.7942 5.6982 5.8629 5.8803 1.0446 1.0518 1.0603 1.0612 1.0927 1.0989 1.0941 1.1024 1.0992 1.1004 1.0938 1.0863 1.0879 1.0888 1.0906 1.0951 1.0948 1.1005 1.1015
irintensity: 3.0257 0.3663 0.7742 0.9845 0.5200 0.3125 3.7728 0.4991 0.1086 0.2087 1.9734 2.3781 1.0175 5.8778 2.8725 1.4969 0.1856 5.3396 0.0860 3.2409 2.0175 4.4620 4.7103 5.3321 0.3681 0.9181 4.3438 0.6961 23.0752 69.0954 36.3525 17.8623 13.2847 22.3591 13.4369 12.9562 0.3921 0.7949 8.6258 9.3392 12.1361 4.6745 19.0171 5.3962 1.6304 0.2901 0.0876 5.5985 3.2428 0.6739 1.6913 6.8694 6.0142 10.3294 6.4863 5.6937 11.1939 0.3185 2.6555 3.5139 2.1173 3.5399 152.4085 1.8167 37.0537 2.4373 10.3354 17.7047 2.4549 3.9609 2.6831 8.3718 21.2052 3.4492 11.1330 14.2983 26.2380 13.4068 12.3426 24.4245 30.4266 11.2475 12.7824 3.0064 91.0696 12.4708 47.2312 18.3779 12.7032 25.5115 9.0981 67.0519 21.9852 3.5502 5.7915 17.0485 22.4854 55.6756 55.9580 61.2622 4.6480 8.5564 4.3627 8.5124 16.2954 25.6338 38.8447 22.5370
temp: 298.150 k
press: 1.00000 atm
elementType: 8 7 6 6 6 6 6 6 6 6 6 6 6 6 6 6 6 6 6 1 1 1 1 1 1 1 1 1 1 1 1 1 1 1 1 1 1 1
symmnumber: 1
zpe: 828570.5 jmol-1
zpe.correction: 0.315586 hartree
zpe.thermalcorrener: 0.333242 hartree
zpe.thermalcorrenthalpy: 0.334186 hartree
zpe.thermalcorrgfe: 0.267834 hartree
zpe.sumelectzpe: -787.804905 hartree
zpe.sumelectthermal: -787.787250 hartree
zpe.sumelectthermalent: -787.786305 hartree
zpe.sumelectthermalfe: -787.852657 hartree
dipole: -3.8702 -1.9637 1.2216
dipole: 4.5086
quadrupole: -94.4993 -111.2317 -113.8384
quadrupole: -7.2255 2.2481 -1.7527
quadrupole: 12.0238 -4.7085 -7.3153 -7.2255 2.2481 -1.7527
hfenergy: -788.1204912 hartree
pointgroup: C01 [X(C17H19N1O1)]
dipole: -1.5206067 0.5413339 -0.7356074 debye
polarizability: 219.9381702|19.2203759|197.3497393|28.1910946|-23.3884441|143.2130331 unknown
InChI: InChI=1S/C17H19NO/c1-2-14(11-12-16-10-6-7-13-18-16)17(19)15-8-4-3-5-9-15/h3-10,13-14H,2,11-12H2,1H3
charge 0 multiplicity 1
38 atoms
O  2.252081 -1.76842 1.473278
N  -2.03815 0.589258 -0.649202
C  0.479392 -1.570823 -0.16759
C  -0.674633 -2.007021 0.782798
C  0.998536 -2.79565 -0.979502
C  -1.554453 -0.834617 1.31604
C  1.644715 -0.998158 0.665378
C  2.091313 -2.443077 -2.010948
C  -2.524249 -0.304312 0.275681
C  2.087331 0.429093 0.512075
C  1.268324 1.428542 -0.082503
C  3.371122 0.78628 1.01381
C  -3.875755 -0.740986 0.240651
C  1.736555 2.759088 -0.171659
C  3.838134 2.109821 0.907712
C  -4.744288 -0.251302 -0.758372
C  3.019927 3.102212 0.312226
C  -2.888197 1.053578 -1.611784
C  -4.243088 0.66755 -1.708913
H  0.101577 -0.814669 -0.877138
H  -1.323449 -2.730453 0.250049
H  -0.226623 -2.545373 1.640014
H  0.131793 -3.250174 -1.499817
H  1.384752 -3.547169 -0.264047
H  -0.903983 -0.01067 1.662655
H  -2.127674 -1.192477 2.191319
H  2.999886 -2.052707 -1.517186
H  2.385527 -3.335583 -2.59306
H  1.737607 -1.674464 -2.72406
H  0.257052 1.188545 -0.436201
H  3.977228 0.004099 1.483267
H  -4.232899 -1.450813 0.994261
H  1.09621 3.528988 -0.616703
H  4.831864 2.373706 1.286526
H  -5.789853 -0.575952 -0.793728
H  3.379858 4.1345 0.231696
H  -2.456671 1.764299 -2.326526
H  -4.879522 1.076411 -2.499696
