program: Gaussian 09
title: 000271827
version: EM64L-G09RevD.01
frameworkgroup: C1[X(C16H24O3)]
method: RPBEPBE
basis: SDD
operation: Freq
keyword: #pfreq=noraman
keyword: PBEPBE/SDD
title: #p freq=noraman PBEPBE/SDD
converged: YES YES NO NO
title: Mulliken charges:
elementType: O O O C C C C C C C C C C C C C C C C H H H H H H H H H H H H H H H H H H H H H H H H
charge: -0.309307 -0.197274 -0.305468 -0.386621 -0.033022 -0.465464 -0.095532 -0.714633 -0.720943 0.199161 0.251572 -0.779895 0.155873 -0.476053 0.481186 -0.330370 -0.425705 -0.810368 -0.528227 0.206612 0.237339 0.201800 0.232908 0.211517 0.261809 0.211781 0.203577 0.220557 0.213661 0.209631 0.213578 0.235968 0.250665 0.255224 0.264039 0.245399 0.231375 0.231448 0.235410 0.220459 0.223724 0.245464 0.227141
chargesum: 0.00000
title: Mulliken charges with hydrogens summed into heavy atoms:
elementType: O O O C C C C C C C C C C C C C C C C
charge: -0.309307 -0.197274 -0.305468 0.057331 0.168779 -0.021038 0.166277 -0.078718 -0.084072 0.199161 0.251572 -0.038039 0.155873 -0.212014 0.481186 -0.084971 -0.194329 -0.123050 0.168102
polarizability: 2.22999160e+02 1.18954490e+01 1.72033156e+02 8.86163824e+00 1.76620349e+01 1.51262190e+02
1716.lowfreq: -41.8867 -9.3696 -7.1180 -0.0008 0.0001 0.0009 3.0818 15.3732 20.2452
frequency: -41.6842 15.2378 18.6899 34.1871 42.0055 56.0405 76.3738 89.3131 91.6055 102.6432 108.4711 143.6254 161.1012 180.1934 194.7560 213.7827 219.3442 239.7868 248.5164 267.1857 310.6749 318.5005 352.7153 362.8458 378.0426 397.3786 411.5520 439.7519 487.5827 502.0880 525.2965 572.6074 584.3158 617.5350 657.4695 706.0063 717.0027 738.2729 756.3228 764.7100 813.7952 823.8815 864.7489 892.9770 908.5307 929.6636 936.7382 947.9738 948.9708 955.7649 962.7835 975.9061 999.3048 1009.2481 1012.6300 1048.2430 1065.1245 1091.6227 1113.2913 1124.9066 1129.7610 1137.3281 1152.1184 1176.5826 1191.3210 1193.7818 1217.4729 1234.1179 1242.3985 1268.3035 1290.7656 1304.7804 1319.9405 1335.1744 1342.4076 1362.5363 1367.8947 1372.2241 1375.9185 1391.2487 1396.9975 1403.2900 1428.3360 1442.3869 1449.4014 1455.7459 1459.3595 1465.0332 1469.2943 1470.3020 1475.5454 1476.0419 1480.5876 1483.2588 1485.5710 1488.9663 1578.0193 1614.4569 1638.5665 2959.8434 2966.7897 2966.8766 2968.6767 2970.7362 2977.0502 2981.5308 2982.8140 2998.7449 3037.5614 3056.2180 3057.5411 3061.2242 3062.3885 3065.4330 3066.5661 3068.3379 3070.4545 3084.6462 3114.6207 3120.4305 3129.6208 3157.6016 3161.6379
redmass: 1.0248 4.0471 2.7629 3.3951 3.8496 3.0698 3.3740 2.6848 1.4958 2.2639 3.1660 4.0895 2.8143 1.2811 3.1227 1.1915 2.8290 1.2664 1.9343 2.8097 3.2108 6.5190 2.4699 2.1846 4.2761 3.5095 3.6019 4.1164 3.7007 3.9569 2.5439 3.8617 3.8958 4.0138 3.9228 4.7413 2.8466 2.6669 2.8185 2.2332 2.8082 1.3938 2.6661 1.4961 1.2570 2.1610 2.6126 1.6039 1.4837 3.6004 1.8189 2.0353 1.6190 2.0188 1.8713 1.5437 2.0598 3.3114 1.2411 1.9308 2.0380 1.5239 1.3400 2.4175 1.8173 1.9396 1.2809 1.5422 2.1184 2.4145 1.1430 1.4525 1.3724 1.4285 1.3736 6.7346 1.2369 1.2274 1.3975 1.2240 1.3040 2.7350 1.2488 1.0696 1.0754 1.0594 1.0544 1.0459 1.0507 1.0816 1.1102 1.0586 1.0567 2.9208 1.0524 1.0583 6.4253 6.9803 8.5511 1.0795 1.0412 1.0353 1.0658 1.0385 1.0374 1.0391 1.0672 1.0614 1.0963 1.0970 1.0999 1.1016 1.1036 1.0991 1.0983 1.0959 1.0994 1.0991 1.1025 1.1005 1.0884 1.0942 1.0941
irintensity: 0.3328 0.1257 0.2810 0.6432 3.0879 4.0396 2.2400 5.6813 0.7236 0.2601 2.2976 6.5528 1.2205 1.5085 0.3899 0.2020 2.2442 0.8394 1.5201 2.6727 1.1243 3.8807 0.1131 0.0413 0.8439 1.8150 1.4425 8.9929 6.6330 9.7233 2.7207 1.3357 4.2944 14.6320 5.4403 8.1911 8.2094 5.7171 6.4860 3.4985 0.4868 38.3676 10.4467 12.4685 1.2985 21.7261 47.3653 1.4969 7.9196 41.6127 2.6991 0.8169 2.6909 34.2135 21.5364 12.3541 24.7768 87.5281 4.4816 11.9857 12.0308 12.3645 2.3982 46.6242 42.1485 4.4347 11.9071 8.0101 63.5084 37.5380 3.0411 13.6442 12.7351 0.1562 7.2357 6.8852 60.9943 20.0733 3.0433 17.0544 13.0843 14.4866 10.0240 10.1510 12.8523 14.2068 10.6773 1.8802 14.3683 9.4828 21.0350 7.3328 10.0009 122.9770 19.8544 12.6683 5.2010 10.8304 81.1201 18.0528 59.6193 41.6239 17.4652 23.3227 36.3141 2.7584 22.3420 32.7421 2.2193 18.5074 30.0798 10.9671 43.8645 40.8489 101.1373 20.5792 62.9930 20.8367 25.8376 10.4907 14.9245 13.0695 1.4743
temp: 298.150 k
press: 1.00000 atm
elementType: 8 8 8 6 6 6 6 6 6 6 6 6 6 6 6 6 6 6 6 1 1 1 1 1 1 1 1 1 1 1 1 1 1 1 1 1 1 1 1 1 1 1 1
symmnumber: 1
zpe: 952133.1 jmol-1
zpe.correction: 0.362648 hartree
zpe.thermalcorrener: 0.384279 hartree
zpe.thermalcorrenthalpy: 0.385223 hartree
zpe.thermalcorrgfe: 0.309354 hartree
zpe.sumelectzpe: -848.264205 hartree
zpe.sumelectthermal: -848.242574 hartree
zpe.sumelectthermalent: -848.241630 hartree
zpe.sumelectthermalfe: -848.317499 hartree
dipole: 1.0867 1.7435 0.8698
dipole: 2.2310
quadrupole: -104.9596 -115.6306 -112.4643
quadrupole: 0.9285 4.6844 -0.7762
quadrupole: 6.0586 -4.6124 -1.4462 0.9285 4.6844 -0.7762
hfenergy: -848.6268531 hartree
pointgroup: C01 [X(C16H24O3)]
dipole: -0.4111969 0.5984419 -0.4931537 debye
polarizability: 222.340746|-13.8914527|163.0904165|7.7617354|-20.6264073|160.863344 unknown
InChI: InChI=1S/C16H24O3/c1-11(2)6-8-14(13(4)17)19-16-10-12(3)7-9-15(16)18-5/h7,9-11,14H,6,8H2,1-5H3
charge 0 multiplicity 1
43 atoms
O  0.025298 0.277409 0.180509
O  -0.325348 -2.489427 -0.117282
O  1.374037 1.663321 -1.985657
C  -2.850334 -0.292918 0.699924
C  -4.217592 0.315402 1.125609
C  -2.263809 0.28223 -0.609314
C  -0.83087 -0.219055 -0.919283
C  -4.114069 1.821942 1.468935
C  -5.330813 0.060479 0.079568
C  -0.770708 -1.758283 -1.036914
C  1.424451 0.146895 -0.021246
C  -1.267117 -2.333086 -2.359354
C  2.090723 0.856837 -1.059805
C  2.161631 -0.648879 0.875721
C  3.568952 -0.773281 0.754075
C  3.485569 0.720294 -1.203873
C  4.217603 -0.089978 -0.306266
C  4.352038 -1.631991 1.732577
C  0.83054 2.907848 -1.395105
H  -2.969304 -1.390669 0.597767
H  -2.113667 -0.132856 1.509593
H  -4.510458 -0.214575 2.056759
H  -2.206024 1.385104 -0.55039
H  -2.9164 0.039577 -1.469741
H  -0.48243 0.221766 -1.877402
H  -5.063317 2.192312 1.899167
H  -3.901051 2.430954 0.569941
H  -3.309417 2.009278 2.204147
H  -6.313437 0.395773 0.460751
H  -5.137044 0.612219 -0.859978
H  -5.411639 -1.015356 -0.166497
H  -2.178132 -1.82137 -2.718039
H  -0.486556 -2.186868 -3.131872
H  -1.457482 -3.412614 -2.254513
H  1.606912 -1.193577 1.646168
H  3.979857 1.259253 -2.018963
H  5.302587 -0.187133 -0.428608
H  4.347506 -1.189121 2.746897
H  3.914427 -2.643464 1.818622
H  5.40471 -1.742346 1.420028
H  1.656822 3.559484 -1.052291
H  0.158169 2.680147 -0.547392
H  0.274886 3.403926 -2.206074
