program: Gaussian 09
title: 000271836
version: EM64L-G09RevD.01
frameworkgroup: C1[X(C21H19NO3)]
method: RPBEPBE
basis: SDD
operation: Freq
keyword: #p
keyword: freq=noraman
keyword: PBEPBE/SDD
title: #p freq=noraman PBEPBE/SDD
converged: YES YES NO NO
title: Mulliken charges:
elementType: O O O N C C C C C C C C C C C C C C C C C C C C C H H H H H H H H H H H H H H H H H H H
charge: -0.280927 -0.202685 -0.209682 -0.009154 -0.300992 -0.592683 0.037426 0.179127 0.095992 0.422591 0.265229 0.296863 -0.377994 -0.352889 -0.419572 -0.377521 -0.265062 -0.228568 -0.340200 -0.351665 -0.264933 -0.259520 -0.233210 -0.225343 -0.661722 0.284191 0.254337 0.287456 0.250118 0.233060 0.237656 0.238981 0.232239 0.232196 0.267854 0.278104 0.224349 0.242184 0.232022 0.235012 0.234303 0.218835 0.256996 0.217202
chargesum: 0.00000
title: Mulliken charges with hydrogens summed into heavy atoms:
elementType: O O O N C C C C C C C C C C C C C C C C C C C C C
charge: -0.280927 -0.202685 -0.209682 -0.009154 -0.016801 -0.050890 0.037426 0.179127 0.095992 0.422591 0.265229 0.296863 -0.127876 -0.119829 -0.181916 -0.138540 -0.032824 0.003628 -0.072346 -0.073561 0.201600 -0.027498 0.001801 0.008959 0.031312
polarizability: 2.82279270e+02 -2.16931188e+01 2.42522978e+02 1.20874189e+01 6.71622190e+00 1.96703130e+02
1716.lowfreq: -11.3324 -2.1004 -0.0005 -0.0004 -0.0003 3.9811 9.6192 18.0091 28.6187
frequency: 8.9534 17.9415 28.4997 30.1204 40.8884 58.4004 63.5223 93.4205 105.3156 128.0481 143.4652 171.0540 173.9567 180.1815 206.8649 228.5584 251.4223 298.8627 326.9583 335.1617 357.7810 401.3693 420.9823 426.6335 433.6393 463.1076 469.4163 478.9485 491.8840 506.3257 565.4152 570.9856 600.9241 612.7667 649.9850 676.4115 688.8247 695.0012 705.7279 718.5832 758.0065 768.7479 779.0317 787.8825 805.9309 813.0401 844.5206 846.4919 859.7680 862.4162 884.5081 895.0228 939.6542 953.9307 961.9384 970.4744 976.6922 988.8649 992.2413 998.0879 1009.6953 1014.7937 1022.1802 1027.9081 1044.3630 1055.7529 1074.2123 1088.9108 1089.8759 1098.8627 1148.5027 1156.7529 1165.9716 1174.3638 1182.0050 1195.0905 1224.6002 1228.1660 1242.9798 1263.6963 1274.8975 1279.2839 1295.4945 1322.3023 1335.7539 1351.1214 1357.2511 1370.7775 1387.3209 1391.3595 1407.7855 1422.9051 1436.3112 1440.3516 1457.0876 1463.7806 1474.6945 1480.9905 1484.1817 1501.0961 1554.9950 1570.0075 1577.0876 1595.9307 1611.8786 1627.1021 1645.1196 2991.9933 3020.0026 3033.3214 3034.1175 3084.9305 3095.0672 3099.1657 3120.7839 3125.3319 3129.0441 3129.6426 3135.4848 3140.3984 3149.9228 3152.2318 3154.7999 3161.1452 3165.2787 3170.3188
redmass: 5.2073 5.8666 5.1644 4.4628 4.6212 4.2620 3.1119 6.1358 4.8748 5.0760 4.7463 5.3083 3.5765 4.1163 3.2152 1.9414 3.5711 2.8499 3.8981 3.9123 5.6199 2.8311 3.2965 3.8877 2.9363 3.4324 3.7321 5.3937 6.6173 6.5151 4.2592 4.8800 4.1252 6.4320 6.1233 4.8731 4.2063 2.1916 3.2090 4.5114 1.2863 2.0576 2.8240 5.7359 2.3500 1.6180 1.3376 3.9151 1.2534 2.9551 2.1566 3.4703 2.1391 1.7797 1.3823 2.1392 1.9563 4.4196 1.5196 1.3433 1.3877 2.8326 2.7471 2.2754 3.1260 3.2177 2.3085 1.9513 2.3177 2.3355 1.3756 1.6678 1.2531 1.0650 1.1403 1.1319 1.9493 1.8186 1.7732 1.8411 1.8889 1.1175 1.5768 1.3692 1.3679 2.9344 1.3078 3.9221 8.4258 1.2389 2.1078 6.1554 2.2683 2.0595 1.0896 1.0473 1.1583 2.1610 1.0518 2.7652 6.8764 7.4616 6.1505 6.8175 6.3339 6.4627 8.8449 1.0361 1.0816 1.0596 1.0616 1.0977 1.1025 1.1012 1.1066 1.0860 1.0854 1.0868 1.0884 1.0886 1.0950 1.0928 1.0988 1.0959 1.1005 1.1009
irintensity: 0.2125 1.0154 1.5348 0.4653 0.3700 0.5741 0.3723 1.2684 0.2407 1.3034 0.6417 0.0945 0.4097 1.2912 4.2982 1.2149 5.0680 9.8005 3.3399 3.9930 3.5208 0.0960 4.0625 1.6875 2.1216 14.7432 3.4315 12.6953 4.5371 6.7435 10.0094 16.4923 3.5950 0.3409 6.5881 3.8452 2.2015 37.8198 10.8788 12.8710 43.7976 44.0453 10.0853 1.9548 4.2878 5.2192 58.8674 5.8254 2.5020 3.1502 5.2307 3.7909 11.7472 5.1475 1.3947 32.0077 22.4849 4.4266 1.7725 0.2232 1.7297 19.9839 20.4837 4.6145 39.5292 18.3556 9.2947 56.6626 137.8854 32.3900 5.9175 12.8636 20.6811 3.4483 7.5911 17.9053 95.7435 7.3092 20.3551 119.1498 45.8354 3.6885 68.0596 1.4644 13.7991 29.8817 9.0310 21.4698 3.7246 19.6142 2.6479 7.7712 21.1054 2.3971 10.5969 14.7238 20.1067 0.6391 17.7985 19.4006 31.2048 93.5691 8.7050 43.7991 11.8070 9.4331 148.5987 18.1026 5.4527 21.8750 10.7620 38.5273 3.8700 3.5069 25.1634 1.3617 0.1662 2.8190 3.3803 10.1357 26.9538 10.5383 50.3018 10.9506 22.4386 25.2594
temp: 298.150 k
press: 1.00000 atm
elementType: 8 8 8 7 6 6 6 6 6 6 6 6 6 6 6 6 6 6 6 6 6 6 6 6 6 1 1 1 1 1 1 1 1 1 1 1 1 1 1 1 1 1 1 1
symmnumber: 1
zpe: 910550.1 jmol-1
zpe.correction: 0.346810 hartree
zpe.thermalcorrener: 0.368983 hartree
zpe.thermalcorrenthalpy: 0.369927 hartree
zpe.thermalcorrgfe: 0.291175 hartree
zpe.sumelectzpe: -1090.303989 hartree
zpe.sumelectthermal: -1090.281816 hartree
zpe.sumelectthermalent: -1090.280872 hartree
zpe.sumelectthermalfe: -1090.359625 hartree
dipole: -0.2335 -0.6125 -5.8378
dipole: 5.8744
quadrupole: -119.1953 -135.1010 -151.9942
quadrupole: -1.8726 -1.6940 -4.5270
quadrupole: 16.2349 0.3292 -16.5641 -1.8726 -1.6940 -4.5270
hfenergy: -1090.6507991 hartree
pointgroup: C01 [X(C21H19N1O3)]
dipole: 0.3232221 0.425484 -2.2485689 debye
polarizability: 289.6126638|-12.7064395|237.7575459|-0.5994027|-7.0170129|194.1351683 unknown
InChI: InChI=1S/C21H19NO3/c1-2-25-21(24)18(20(23)16-9-4-3-5-10-16)14-19-17-11-7-6-8-15(17)12-13-22-19/h3-13,18H,2,14H2,1H3
charge 0 multiplicity 1
44 atoms
O  -0.08858 -1.984267 -0.924638
O  -1.927337 1.090901 2.066883
O  -1.060429 -2.453793 1.147715
N  2.647795 -1.255431 1.379117
C  -0.416069 -0.131866 0.583921
C  0.635975 0.078225 1.718325
C  2.056612 -0.051514 1.202414
C  2.724354 1.051774 0.537803
C  -1.775445 0.527158 0.947123
C  4.070413 0.836997 0.047117
C  -0.582835 -1.634639 0.334635
C  -2.883059 0.518502 -0.065646
C  2.118933 2.337689 0.342997
C  4.665903 -0.450179 0.252187
C  4.757939 1.905245 -0.616555
C  3.935685 -1.439785 0.908011
C  2.810983 3.361701 -0.309266
C  4.139523 3.14434 -0.793903
C  -2.704659 0.066974 -1.402321
C  -4.15563 1.01083 0.336983
C  -0.107154 -3.445843 -1.258195
C  -3.780573 0.112302 -2.31466
C  -5.228464 1.048137 -0.573356
C  -5.042921 0.60012 -1.904395
C  -1.467824 -3.865147 -1.82068
H  -0.05191 0.322394 -0.356778
H  0.44803 1.062152 2.180826
H  0.472175 -0.681522 2.499286
H  1.107323 2.525236 0.717252
H  5.683278 -0.649268 -0.101952
H  5.777791 1.73411 -0.980985
H  4.358797 -2.434137 1.086821
H  2.338711 4.340228 -0.448631
H  4.669752 3.957718 -1.301439
H  -1.736687 -0.318465 -1.737639
H  -4.272368 1.356071 1.369394
H  0.70165 -3.547534 -1.999058
H  0.141436 -4.00906 -0.342033
H  -3.635305 -0.230898 -3.344743
H  -6.206133 1.423886 -0.252853
H  -5.876207 0.631643 -2.615377
H  -1.429556 -4.927472 -2.125825
H  -2.25767 -3.754345 -1.059385
H  -1.735742 -3.263566 -2.707005
