program: Gaussian 09
title: 000026123
version: EM64L-G09RevD.01
frameworkgroup: C1[X(C10H21NO)]
method: RPBEPBE
basis: SDD
operation: Freq
keyword: #p
keyword: freq=noraman
keyword: PBEPBE/SDD
title: #p freq=noraman PBEPBE/SDD
converged: YES YES NO NO
title: Mulliken charges:
elementType: O N C C C C C C C C C C H H H H H H H H H H H H H H H H H H H H H
charge: -0.450564 -0.114851 0.376103 0.375499 -0.208526 -0.271152 -0.815102 -0.776054 -0.770450 -0.774503 -0.629606 -0.629561 0.209553 0.212732 0.226098 0.203754 0.244631 0.205673 0.243449 0.204283 0.204906 0.246198 0.214837 0.206413 0.213205 0.236000 0.342215 0.231640 0.186314 0.218531 0.217253 0.187101 0.233982
chargesum: 0.00000
title: Mulliken charges with hydrogens summed into heavy atoms:
elementType: O N C C C C C C C C C C
charge: -0.108349 -0.114851 0.376103 0.375499 0.001028 -0.058420 -0.140620 -0.122649 -0.104509 -0.118884 0.006879 0.008775
polarizability: 1.23624419e+02 -1.76577915e+00 1.22140855e+02 8.27788223e-01 -5.98390490e-02 1.04464936e+02
1716.lowfreq: -12.9304 -10.2075 -0.0007 -0.0005 -0.0003 15.6542 68.2024 85.8311 130.1095
frequency: 68.1910 85.8126 130.0285 149.1266 164.8551 187.5191 202.5231 210.7177 227.5401 250.9320 253.3215 264.3960 273.5786 288.2228 302.9785 312.7845 323.6000 350.6156 353.4764 373.3987 411.3023 474.7508 557.0907 570.0813 594.9220 764.6406 777.2071 852.4901 873.2831 883.8959 939.8627 943.6762 958.0238 969.0997 990.1812 994.7165 1030.0016 1031.1191 1069.8934 1090.2956 1092.0376 1135.9981 1140.1256 1171.6355 1181.6344 1190.0102 1207.1889 1233.4479 1253.9712 1271.2443 1284.4756 1292.1146 1347.5374 1359.8071 1373.8203 1381.6582 1390.3563 1400.9011 1415.8518 1442.6534 1452.1848 1457.4083 1462.6484 1464.1648 1465.1261 1469.6960 1475.8503 1481.5931 1482.1742 1483.9520 1488.0627 1496.7757 2816.5966 2845.4815 2860.2536 2944.1312 2964.2972 2973.4290 2977.1394 2980.9775 3029.8008 3031.4864 3051.1521 3056.4516 3061.5062 3067.4922 3078.8075 3088.7285 3096.6643 3098.5747 3103.1771 3107.7470 3560.9950
redmass: 3.4594 2.0025 1.3963 1.5679 2.3168 1.2026 1.1716 1.2023 1.0891 2.1232 2.1826 1.4231 2.0864 2.3206 1.4847 2.5660 2.0282 2.8287 2.7020 2.5229 2.6013 3.0520 3.2266 2.3548 3.5104 3.0714 3.7827 2.5866 2.5227 3.4865 1.3827 1.3712 1.9552 1.7887 1.3990 1.7467 1.6130 2.1182 1.8545 1.4758 1.5890 1.4906 1.6314 1.7828 2.2054 2.3939 2.5271 3.0617 2.9391 2.7983 1.8156 1.7248 1.4418 1.3461 1.2032 1.2180 1.2042 1.2074 1.1369 1.1805 1.0522 1.0542 1.0495 1.0501 1.0594 1.0514 1.0545 1.0521 1.0521 1.0527 1.0595 1.0559 1.0811 1.0581 1.0581 1.0870 1.0376 1.0382 1.0369 1.0372 1.0743 1.0739 1.0965 1.0968 1.0984 1.0982 1.0990 1.0986 1.0968 1.0976 1.0967 1.0969 1.0658
irintensity: 0.3676 0.5522 0.4594 0.7455 0.3710 0.2186 1.0655 10.2066 0.1007 4.4575 2.0702 0.9962 7.0212 13.8748 76.8918 0.3703 48.1535 5.6245 16.8949 3.6205 5.8581 1.3030 0.1690 5.0961 9.0951 3.4017 0.9085 19.9964 4.3159 20.5843 2.8365 3.4607 7.0147 8.2695 21.0084 46.4454 18.6658 68.8410 8.0155 1.2548 5.0571 7.1668 3.7506 0.9874 37.4533 4.1889 10.8219 2.4244 3.8446 0.1600 12.9834 0.9134 10.7976 0.2413 0.7176 44.8204 27.4015 8.2130 1.7358 6.4793 0.9810 0.8211 5.5215 14.1536 9.1607 0.7656 13.2254 1.6408 9.5132 14.9633 29.8893 30.4017 51.7233 60.0957 210.0586 54.2459 31.0989 50.9649 29.8658 35.5036 19.1565 67.3059 12.0782 54.0771 19.8046 76.5356 19.2283 36.8302 23.6559 10.1698 37.8163 24.0218 4.6328
temp: 298.150 k
press: 1.00000 atm
elementType: 8 7 6 6 6 6 6 6 6 6 6 6 1 1 1 1 1 1 1 1 1 1 1 1 1 1 1 1 1 1 1 1 1
symmnumber: 1
zpe: 769145.9 jmol-1
zpe.correction: 0.292952 hartree
zpe.thermalcorrener: 0.308203 hartree
zpe.thermalcorrenthalpy: 0.309147 hartree
zpe.thermalcorrgfe: 0.253200 hartree
zpe.sumelectzpe: -522.583116 hartree
zpe.sumelectthermal: -522.567865 hartree
zpe.sumelectthermalent: -522.566921 hartree
zpe.sumelectthermalfe: -522.622869 hartree
dipole: -0.3491 -1.3050 0.1948
dipole: 1.3649
quadrupole: -73.9337 -75.0682 -79.0445
quadrupole: -4.7281 3.9939 0.9735
quadrupole: 2.0817 0.9473 -3.0290 -4.7281 3.9939 0.9735
hfenergy: -522.8760685 hartree
pointgroup: C01 [X(C10H21N1O1)]
dipole: -0.1608105 0.5062902 -0.0784557 debye
polarizability: 123.3670748|1.7815688|122.2698758|-1.7286081|-0.4950361|104.5932586 unknown
InChI: InChI=1S/C10H21NO/c1-9(2)7(11(5)6)10(3,4)8(9)12/h7-8,12H,1-6H3
charge 0 multiplicity 1
33 atoms
O  2.700467 0.032613 0.463545
N  -1.86532 -0.042092 -0.028009
C  0.476247 1.159974 -0.230072
C  0.557113 -1.098916 -0.189629
C  -0.442685 0.008651 0.360974
C  1.588148 0.055493 -0.486432
C  0.867657 2.250491 0.782875
C  0.014384 1.781091 -1.565647
C  1.006521 -2.131137 0.860221
C  0.140059 -1.799099 -1.502068
C  -2.603559 1.1535 0.442339
C  -2.528477 -1.269717 0.472146
H  -0.34792 0.029533 1.48023
H  1.978707 0.060557 -1.526855
H  -0.021464 2.832956 1.088232
H  1.5955 2.96508 0.3487
H  1.316077 1.809481 1.690546
H  -0.696546 2.613063 -1.410988
H  -0.48432 1.040756 -2.213146
H  0.88727 2.193016 -2.109521
H  0.145611 -2.750792 1.176359
H  1.432637 -1.637266 1.748756
H  1.782768 -2.803401 0.450535
H  -0.532722 -2.655283 -1.31325
H  1.040518 -2.194687 -2.010164
H  -0.381818 -1.115283 -2.192293
H  3.253254 0.843129 0.328507
H  -2.16268 2.069006 0.018885
H  -2.601994 1.252175 1.558714
H  -3.654205 1.091817 0.105576
H  -3.580906 -1.280447 0.135362
H  -2.52015 -1.341042 1.590303
H  -2.031371 -2.16552 0.07027
