program: Gaussian 09
title: 000271794
version: EM64L-G09RevD.01
frameworkgroup: C1[X(C9H7IO4)]
method: RPBEPBE
basis: SDD
operation: Freq
keyword: #pfreq=noraman
keyword: PBEPBE/SDD
title: #p freq=noraman PBEPBE/SDD
converged: YES YES NO NO
title: Mulliken charges:
elementType: I O O O O C C C C C C C C C H H H H H H H
charge: 0.124834 -0.284841 -0.431752 -0.243129 -0.211982 0.399184 0.276620 -0.413355 -0.329337 -0.299931 -0.295416 0.120410 0.261419 -0.746130 0.344727 0.282656 0.293821 0.255931 0.255903 0.250379 0.389989
chargesum: 0.00000
title: Mulliken charges with hydrogens summed into heavy atoms:
elementType: I O O O O C C C C C C C C C
charge: 0.124834 -0.284841 -0.041763 -0.243129 -0.211982 0.399184 0.276620 -0.068629 -0.046681 -0.006110 -0.295416 0.120410 0.261419 0.016083
polarizability: 2.02458534e+02 -3.77464265e+00 1.58846296e+02 -1.98996818e-02 -2.03616580e-01 5.16695623e+01
1716.lowfreq: -6.8466 -5.5593 0.0003 0.0005 0.0005 4.8422 21.5933 50.1253 57.4430
frequency: 21.5705 50.1244 57.4390 74.1028 96.7083 107.6571 131.0808 177.3595 187.8590 237.8911 254.0614 303.1489 365.4508 383.0041 465.3218 503.5213 521.7140 541.3469 558.0242 598.5487 603.8160 671.1030 674.1980 732.9247 739.2440 824.6508 901.5223 932.3616 933.2173 953.8044 978.0346 993.0005 1037.3855 1040.5268 1105.0987 1119.0608 1166.9429 1195.5034 1256.9661 1320.6573 1379.7649 1384.3256 1415.6851 1430.2710 1451.6614 1452.2611 1574.8695 1582.2529 1641.9585 1671.2127 3009.5114 3097.3629 3146.7383 3173.0070 3181.7743 3222.4819 3532.9602
redmass: 7.2312 3.9508 2.8930 1.5609 6.2816 10.4693 6.0856 4.5129 15.1956 6.7479 4.8312 4.6442 6.8764 6.9258 3.5811 5.0799 5.4737 3.8950 3.6320 4.7411 1.3495 6.5774 2.6478 7.9255 4.6196 7.8931 1.5369 7.2364 1.4248 1.4051 6.1723 2.1756 2.8333 1.6428 1.5141 1.4259 3.5199 3.4652 1.2133 2.7641 8.3222 1.2616 3.2205 3.6242 1.0596 1.0464 7.6021 6.9730 9.1413 9.9185 1.0368 1.0973 1.1011 1.0933 1.0934 1.0933 1.0642
irintensity: 3.6076 0.0193 2.7636 0.5970 1.3690 0.4690 0.0259 0.0025 0.9129 1.8613 0.9113 0.7457 4.6683 8.7194 4.5349 30.5481 5.0851 1.1591 17.1929 60.5374 141.9736 18.2050 0.3534 10.6290 48.5744 64.4836 28.6685 61.1971 5.5297 24.6872 0.2933 139.3225 237.8439 9.5157 47.3003 153.4825 594.2207 55.3736 7.2430 165.3092 23.4876 74.2947 112.5651 8.0453 25.2565 19.7285 145.8895 32.9770 222.6470 188.3657 0.5754 5.3065 9.1374 2.5921 1.2595 19.0802 51.9889
temp: 298.150 k
press: 1.00000 atm
elementType: 53 8 8 8 8 6 6 6 6 6 6 6 6 6 1 1 1 1 1 1 1
symmnumber: 1
zpe: 371823.6 jmol-1
zpe.correction: 0.141620 hartree
zpe.thermalcorrener: 0.155567 hartree
zpe.thermalcorrenthalpy: 0.156511 hartree
zpe.thermalcorrgfe: 0.097093 hartree
zpe.sumelectzpe: -658.563970 hartree
zpe.sumelectthermal: -658.550023 hartree
zpe.sumelectthermalent: -658.549079 hartree
zpe.sumelectthermalfe: -658.608497 hartree
dipole: -1.7305 -2.8027 0.0511
dipole: 3.2943
quadrupole: -92.2968 -85.5448 -95.9950
quadrupole: 2.1716 -0.2455 0.0328
quadrupole: -1.0180 5.7341 -4.7161 2.1716 -0.2455 0.0328
hfenergy: -658.7055902 hartree
pointgroup: C01 [X(C9H7I1O4)]
dipole: 1.294481 -0.0140353 0.0629536 debye
dipolederiv: -0.0398826 0.1210798 0.0044229 0.136242 -0.4956978 -0.0214716 0.0053151 -0.0226511 0.0134819 -1.8119169 0.8482457 -0.0082488 1.0653063 -1.1269685 -0.0201188 0.0042743 -0.0284602 -0.1915846 -0.3165652 0.1596251 0.0108637 0.054929 -1.3471404 -0.041548 0.0062372 -0.0370719 -0.4165209 -1.1225745 -0.0758652 -0.0335182 -0.1463525 -0.6453297 -0.0201637 -0.035945 -0.0175654 -0.3272916 -0.5822991 -0.2131669 -0.0280792 0.3970121 -1.0299585 -0.0369034 0.0144947 -0.0606454 -0.2881351 1.3706805 -0.5441331 0.0143455 -0.3130149 0.1832911 -0.0084572 0.0319632 -0.0176856 0.1068142 -0.21256 -0.4899953 -0.0322962 -0.2906698 -0.2270193 -0.0222172 -0.0233671 -0.0285983 0.0148321 -0.2892659 0.2836209 0.0079464 -0.0844653 -0.1349759 -0.0042096 -0.0107719 0.0106436 -0.1150792 -0.2228684 0.1437062 0.00444 0.3247838 -0.4591391 -0.0073873 0.0122635 -0.0141219 -0.0952652 -0.0987068 0.0841675 0.0039311 0.1805773 -0.4711112 -0.0142906 0.0082309 -0.0181474 -0.0697925 0.0179061 -0.3078539 -0.0097897 -0.3810815 1.3114852 0.0626568 -0.012671 0.0658728 -0.1612695 1.4920273 0.2974217 0.0614219 0.3751485 1.7838848 0.0859869 0.0640417 0.0835164 0.2390592 1.6618859 -0.2685113 0.042 -1.2325342 1.8595824 0.0658644 -0.020305 0.1018033 0.2232438 -0.4848212 -0.0081371 -0.0224368 -0.1286959 -0.028832 -0.0086294 -0.0351971 -0.0027382 0.0123143 0.20947 0.0120891 0.0013858 0.0016473 0.1260748 -0.0024947 0.0003745 -0.0033007 0.1834648 0.0619219 -0.0595021 -0.006918 -0.0697577 0.0845429 -0.0065783 -0.0078941 -0.0061392 0.1677346 0.0510508 0.0516593 -0.0015364 0.0212819 0.145251 -0.000167 -0.0030182 0.000559 0.1642119 0.0893009 0.0031001 -0.0020295 0.0079669 0.0872633 -0.0864571 -0.0382656 -0.0752938 -0.0133611 0.0866816 -0.0044835 0.0087042 -0.0066436 0.0589792 0.0986635 0.046824 0.0865469 0.0190443 0.0218572 0.0544017 -0.0000656 0.0994044 -0.0365668 -0.0096924 0.0044238 -0.0110781 0.1315886 0.1186785 -0.0874687 -0.0145431 -0.0110842 0.3623846 -0.0023855 -0.0110079 -0.0054447 0.40251 unknown
polarizability: 167.072079|-17.7620152|193.766406|3.1532707|6.7974217|52.1359073 unknown
InChI: InChI=1S/C9H7IO4/c1-5(11)14-8-3-6(9(12)13)2-7(10)4-8/h2-4,12H,1H3
charge 0 multiplicity 1
21 atoms
I  -1.388035 4.106179 0.224773
O  2.303381 0.128634 0.156666
O  -2.038014 -2.644531 -0.133604
O  -3.761265 -1.087743 -0.123631
O  2.385603 -2.22433 -0.002317
C  0.892386 0.316219 0.112555
C  -1.444181 -0.318395 -0.002346
C  -0.079901 -0.70372 0.027378
C  0.527962 1.683248 0.168124
C  -1.836883 1.042905 0.050774
C  -0.836278 2.029827 0.13647
C  -2.532604 -1.335986 -0.09043
C  2.965367 -1.127922 0.097023
C  4.454763 -0.888582 0.17518
H  0.195604 -1.756634 -0.015839
H  1.317031 2.435965 0.234755
H  -2.901902 1.288725 0.02424
H  4.70782 -0.375815 1.119306
H  4.778501 -0.231964 -0.65067
H  4.985224 -1.849575 0.119073
H  -2.801079 -3.279803 -0.191483
