program: Gaussian 09
title: 000271806
version: EM64L-G09RevD.01
frameworkgroup: C1[X(C16H17NO)]
method: RPBEPBE
basis: SDD
operation: Freq
keyword: #p
keyword: freq=noraman
keyword: PBEPBE/SDD
title: #p freq=noraman PBEPBE/SDD
converged: YES YES NO NO
title: Mulliken charges:
elementType: O N C C C C C C C C C C C C C C C C H H H H H H H H H H H H H H H H H
charge: -0.240699 -0.417411 0.178824 -0.446236 0.403689 -0.537100 -0.750991 -0.751773 0.227584 -0.544950 0.147256 0.119552 -0.408260 0.208273 -0.363948 -0.367457 -0.267294 -0.214295 0.217329 0.202395 0.244998 0.233414 0.216637 0.218884 0.237580 0.232245 0.227108 0.210259 0.267524 0.268467 0.310656 0.254775 0.230877 0.226407 0.225677
chargesum: 0.00000
title: Mulliken charges with hydrogens summed into heavy atoms:
elementType: O N C C C C C C C C C C C C C C C C
charge: -0.240699 -0.106754 0.178824 -0.026512 0.403689 -0.058688 -0.077891 -0.082161 0.227584 -0.277426 0.147256 0.119552 -0.139793 0.208273 -0.109172 -0.136580 -0.040887 0.011382
polarizability: 2.60742378e+02 -1.12176482e+01 2.03041979e+02 4.94777571e+00 9.91177925e+00 1.07594057e+02
1716.lowfreq: -8.6300 -3.4445 -0.0003 -0.0003 0.0005 9.7689 39.8927 68.9628 75.4354
frequency: 39.8000 68.8162 75.4326 85.9960 168.6108 180.0681 201.6577 213.1094 219.8869 240.8166 251.8686 263.3939 310.2187 351.5663 360.3152 386.1940 425.9061 438.7821 453.8861 497.1126 521.3302 538.0783 557.3999 573.3566 600.6632 619.5501 630.3822 687.3785 695.5314 753.9024 755.7258 764.8229 766.9185 799.8284 808.1195 856.3982 865.5021 890.5021 899.3428 920.0565 927.6656 941.9548 946.7548 979.8001 987.5192 1016.5412 1019.1849 1045.6896 1086.8289 1112.6309 1119.8242 1144.5663 1161.3438 1170.8676 1200.1445 1213.1803 1240.0973 1244.8749 1260.9285 1280.5785 1297.2811 1302.4459 1324.1019 1345.4993 1353.2200 1379.0659 1389.4969 1398.9577 1419.5584 1444.7367 1455.9931 1457.4548 1469.9438 1471.6975 1475.5947 1482.4747 1490.4829 1520.0214 1570.4733 1579.8275 1588.2214 1629.7311 2975.6765 2979.3446 2981.4383 2984.4386 3033.0495 3057.7313 3070.3559 3076.1199 3085.3135 3098.3044 3128.7636 3139.6002 3145.3904 3156.0529 3169.7006 3236.1991 3608.2715
redmass: 4.4670 3.1944 4.7650 5.8004 1.2937 3.2966 2.8219 2.0035 2.2165 1.9227 2.2797 4.6813 2.7911 5.3354 2.3921 3.0405 2.9386 3.9849 4.1294 3.1309 2.5272 1.4779 4.5195 2.7778 4.3536 3.4253 5.0369 3.6551 3.9066 1.5950 2.5657 3.9603 2.5199 2.4960 1.9744 1.4518 4.8423 2.0690 1.7211 1.6608 1.9736 1.3657 1.8137 1.3032 1.5199 1.6142 2.0169 1.7951 3.1060 1.6681 1.6545 1.3516 2.1758 1.1210 2.1271 2.1816 1.8451 1.7073 2.2300 2.0785 2.1329 2.4329 1.5410 1.8057 1.9979 1.1898 4.0197 1.2446 2.6230 1.0788 3.0745 1.0956 1.0516 1.0806 1.0578 2.9145 1.0708 5.2090 9.2544 6.6163 6.7635 6.9012 1.0576 1.0488 1.0517 1.0402 1.1009 1.0959 1.0993 1.0983 1.0991 1.0974 1.0857 1.0897 1.0909 1.0947 1.0994 1.0973 1.0810
irintensity: 0.9011 1.8982 0.3914 1.4093 0.3028 2.4999 0.8540 0.7407 5.4122 1.7707 5.0325 1.3924 0.4616 2.9919 1.4915 4.5174 12.0796 16.9290 1.0811 0.8819 14.4392 66.9442 4.2418 12.8640 1.5614 2.5330 0.9292 4.2956 3.1601 84.4524 29.6235 11.1408 1.6923 6.1136 11.3165 0.9621 1.1439 4.0639 20.3802 7.4077 3.6673 1.2151 11.5194 0.4793 3.2575 4.5118 10.1519 19.4672 1.1349 28.2749 21.8253 10.4939 49.1939 0.3291 23.5000 2.4968 93.0505 9.9175 22.7061 84.3121 8.8515 17.6487 30.6143 12.8222 7.1416 20.2884 65.1409 22.9614 37.8223 13.4793 16.6545 12.6375 8.9288 6.0274 19.3056 2.6021 24.7693 62.0911 54.7449 278.5896 135.2113 0.6726 27.9332 7.5675 37.1563 44.8347 36.2035 22.8124 19.3658 61.8570 20.1667 33.1554 0.7364 11.0665 14.4588 19.9030 19.7241 0.8579 86.1383
temp: 298.150 k
press: 1.00000 atm
elementType: 8 7 6 6 6 6 6 6 6 6 6 6 6 6 6 6 6 6 1 1 1 1 1 1 1 1 1 1 1 1 1 1 1 1 1
symmnumber: 1
zpe: 757303.3 jmol-1
zpe.correction: 0.288442 hartree
zpe.thermalcorrener: 0.304176 hartree
zpe.thermalcorrenthalpy: 0.305120 hartree
zpe.thermalcorrgfe: 0.245978 hartree
zpe.sumelectzpe: -748.591610 hartree
zpe.sumelectthermal: -748.575876 hartree
zpe.sumelectthermalent: -748.574932 hartree
zpe.sumelectthermalfe: -748.634073 hartree
dipole: 2.6826 -6.5843 0.5343
dipole: 7.1299
quadrupole: -95.8419 -108.5842 -109.7264
quadrupole: 6.6717 -5.8409 9.7228
quadrupole: 8.8756 -3.8667 -5.0089 6.6717 -5.8409 9.7228
hfenergy: -748.8800518 hartree
pointgroup: C01 [X(C16H17N1O1)]
dipole: 1.3424307 2.4566708 -0.1767345 debye
polarizability: 261.2725991|4.2675691|202.1633006|13.9103453|6.2392204|107.9425139 unknown
InChI: InChI=1S/C16H17NO/c1-16(2)8-7-11(18)9-14(16)13-10-17-15-6-4-3-5-12(13)15/h3-6,9-10,17H,7-8H2,1-2H3
charge 0 multiplicity 1
35 atoms
O  -3.088851 -2.683343 0.359771
N  2.421384 1.683974 0.718667
C  -1.848386 1.2624 -0.769865
C  -3.022908 0.522499 -1.486632
C  -0.886561 0.213614 -0.151972
C  -3.729505 -0.532445 -0.61516
C  -2.42295 2.177599 0.356899
C  -1.147558 2.134445 -1.848725
C  0.524218 0.54297 0.117949
C  -1.349707 -1.050449 0.169753
C  -2.732441 -1.517524 -0.007656
C  1.671976 -0.372772 0.060412
C  1.047809 1.78694 0.511761
C  2.840301 0.375033 0.440552
C  1.840749 -1.729309 -0.32837
C  4.136193 -0.183372 0.47403
C  3.129742 -2.296044 -0.300672
C  4.265866 -1.536472 0.104183
H  -2.618332 0.025184 -2.390999
H  -3.753545 1.27866 -1.835132
H  -4.478426 -1.10358 -1.192595
H  -4.282169 -0.0530 0.21858
H  -1.628908 2.74286 0.875356
H  -3.128341 2.910411 -0.078192
H  -2.960099 1.588671 1.120739
H  -0.364899 2.787254 -1.429994
H  -0.674378 1.500175 -2.620415
H  -1.897803 2.777648 -2.346219
H  -0.687202 -1.770956 0.661986
H  0.534026 2.724585 0.707913
H  3.024697 2.44001 1.035265
H  0.987333 -2.329322 -0.657437
H  5.010007 0.408464 0.768426
H  3.264507 -3.341923 -0.596874
H  5.253959 -2.009181 0.119072
