program: Gaussian 09
title: 000271818
version: EM64L-G09RevD.01
frameworkgroup: C1[X(C14H16Br2N2)]
method: RPBEPBE
basis: SDD
operation: Freq
keyword: #p
keyword: freq=noraman
keyword: PBEPBE/SDD
title: #p freq=noraman PBEPBE/SDD
converged: YES YES NO NO
title: Mulliken charges:
elementType: Br Br N N C C C C C C C C C C C C C C H H H H H H H H H H H H H H H H
charge: -0.648982 -0.648800 -0.063216 -0.063176 -0.446229 -0.446055 -0.110551 -0.110956 -0.195954 -0.196691 -0.127773 -0.127761 -0.185953 -0.185556 -0.221818 -0.221597 -0.164090 -0.164078 0.297558 0.215783 0.297430 0.215829 0.344727 0.344336 0.294632 0.294159 0.249514 0.249475 0.267289 0.267323 0.242734 0.242690 0.252897 0.252859
chargesum: 0.00000
title: Mulliken charges with hydrogens summed into heavy atoms:
elementType: Br Br N N C C C C C C C C C C C C C C
charge: -0.648982 -0.648800 -0.063216 -0.063176 0.067112 0.067204 0.234175 0.233381 0.098678 0.097468 0.121742 0.121714 0.081336 0.081767 0.020915 0.021093 0.088807 0.088781
polarizability: 3.08286716e+02 5.90337551e+01 2.04257737e+02 1.67232974e-01 -2.75592108e-02 1.85076994e+02
1716.lowfreq: -7.4441 -4.3883 0.0004 0.0004 0.0005 7.0046 31.6258 35.4501 48.4401
frequency: 31.6241 35.3357 48.4395 53.0504 56.9292 64.1633 72.0458 87.1394 104.3710 119.8030 121.7006 170.4315 205.5055 219.9823 250.6324 300.1116 303.6467 395.4179 401.2453 424.8893 430.4324 438.3818 536.6635 569.4174 585.2922 635.0811 638.7960 676.1638 677.1908 737.9919 744.6911 758.2868 801.0929 823.5806 837.4597 844.1518 899.1071 908.5775 924.1333 948.2025 948.6790 974.4604 985.2797 995.4976 995.5944 1008.5690 1016.4477 1036.6648 1040.3953 1083.1639 1095.2834 1102.7280 1121.2051 1150.3351 1152.3864 1169.4162 1169.5041 1207.1836 1212.6377 1229.1746 1251.9619 1270.6954 1305.5968 1325.7702 1347.1522 1352.6246 1358.1290 1393.6246 1397.0925 1431.9941 1433.9494 1457.3618 1460.7320 1468.6278 1469.5464 1552.9995 1553.3910 1623.6686 1623.8529 1694.5899 2981.9681 2982.8535 3050.1334 3050.7935 3112.1757 3120.0498 3156.4777 3159.5052 3163.1742 3163.2192 3174.1126 3174.2033 3194.4138 3194.4686 3203.5353 3203.5630
redmass: 10.6593 5.9102 15.1446 6.2806 6.3275 7.0158 9.3568 4.4923 4.3190 6.3560 5.3194 2.6138 2.7082 2.8168 4.8754 5.4553 2.4336 3.0773 2.7972 3.6472 3.1234 3.7239 2.6693 3.7501 5.4619 6.1843 6.1682 2.7779 2.7804 1.2815 1.3274 3.2345 4.3621 1.2791 1.2658 1.8494 1.3176 1.4407 1.7413 1.3824 1.3940 1.8611 1.1596 1.4303 1.4037 3.6603 3.4488 2.2773 2.2703 2.2315 1.7234 2.5488 2.8704 4.0205 3.5019 1.0820 1.0832 1.1795 1.1695 1.2085 1.1890 1.2840 1.3266 1.3427 1.2127 1.3471 1.8059 2.5573 2.1641 1.1243 1.1171 2.3310 2.2798 1.9312 1.9170 5.0662 5.0545 5.2780 5.2744 6.2918 1.0586 1.0587 1.1034 1.1035 1.0977 1.0873 1.0968 1.0977 1.0886 1.0887 1.0914 1.0913 1.0986 1.0986 1.0999 1.0999
irintensity: 5.6067 8.8562 0.3791 11.8672 0.1104 2.6348 32.2484 1.1948 1.7553 39.5067 8.7089 3.0077 2.9964 10.3441 0.7013 0.4154 2.8595 1.3638 2.2900 4.0084 14.5446 43.0931 0.0549 5.2660 3.0008 17.8215 0.0193 11.0336 96.2108 71.3334 0.4762 22.4783 0.0575 90.7022 5.2915 4.2057 123.0273 12.9828 0.1533 12.2471 1.7929 0.5458 86.0675 4.8291 3.3639 18.2284 3.9566 9.8345 5.3083 3.9630 0.2144 5.0115 0.9495 56.4322 11.1506 5.0492 0.7774 0.0167 0.0146 6.9253 0.1795 3.0838 0.1001 0.8024 5.2539 1.3540 1.9825 2.8722 3.0206 21.4693 17.7821 185.6502 26.0904 34.4947 0.2441 134.7296 9.5531 37.7414 25.0368 0.7758 20.4565 32.0951 3.9845 3.9259 0.0049 5.5702 45.1952 217.2442 6.5859 7.1760 2.2091 3.6325 5.0916 2.3395 11.1028 6.4208
temp: 298.150 k
press: 1.00000 atm
elementType: 35 35 7 7 6 6 6 6 6 6 6 6 6 6 6 6 6 6 1 1 1 1 1 1 1 1 1 1 1 1 1 1 1 1
symmnumber: 1
zpe: 708391.3 jmol-1
zpe.correction: 0.269812 hartree
zpe.thermalcorrener: 0.288360 hartree
zpe.thermalcorrenthalpy: 0.289304 hartree
zpe.thermalcorrgfe: 0.219123 hartree
zpe.sumelectzpe: -678.170338 hartree
zpe.sumelectthermal: -678.151790 hartree
zpe.sumelectthermalent: -678.150846 hartree
zpe.sumelectthermalfe: -678.221027 hartree
dipole: -0.0032 -0.0014 6.9137
dipole: 6.9137
quadrupole: -67.9172 -159.9236 -110.2635
quadrupole: 24.5813 0.0685 -0.1538
quadrupole: 44.7843 -47.2222 2.4379 24.5813 0.0685 -0.1538
hfenergy: -678.4401499 hartree
pointgroup: C01 [X(C14H16Br2N2)]
dipole: 0.006157 2.7200133 0.0142308 debye
polarizability: 304.8554687|-0.0471544|185.0776924|-61.8886182|-0.0342532|207.6882856 unknown
InChI: InChI=1S/C14H16N2.2Br/c1-3-9-15(10-4-1)13-7-8-14-16-11-5-2-6-12-16;;/h1-12H,13-14H2;;
charge 0 multiplicity 1
34 atoms
Br -1.257752 -1.114418 -2.133813
Br 1.25137 -1.132295 2.122798
N  -2.731973 0.567978 0.420628
N  2.734171 0.561749 -0.419292
C  -1.949796 1.740792 -0.103779
C  1.956636 1.73661 0.108185
C  -2.086817 -0.643081 0.591616
C  2.083944 -0.6452 -0.597613
C  -0.533383 1.760082 0.41554
C  0.540731 1.76361 -0.411737
C  -4.111493 0.655917 0.467216
C  4.114408 0.643302 -0.460356
C  -2.849006 -1.786786 0.948715
C  2.841868 -1.79098 -0.957795
C  -4.886565 -0.455707 0.779185
C  4.885205 -0.470609 -0.77461
C  -4.241799 -1.704688 1.036108
C  4.235356 -1.715214 -1.039786
H  -1.94337 1.632422 -1.20568
H  -2.501892 2.65606 0.181523
H  1.949687 1.625012 1.209695
H  2.513483 2.64988 -0.174069
H  -0.998311 -0.641111 0.680855
H  0.995569 -0.637978 -0.690959
H  -0.39241 1.718726 1.504279
H  0.400104 1.733938 -1.500954
H  -4.542701 1.636115 0.25007
H  4.549564 1.620276 -0.236737
H  -2.305499 -2.715739 1.131954
H  2.294266 -2.716298 -1.147103
H  -5.9734 -0.354957 0.823959
H  5.972664 -0.374954 -0.815325
H  -4.835378 -2.585597 1.297523
H  4.825815 -2.597665 -1.303041
