program: Gaussian 09
title: 000271828
version: EM64L-G09RevD.01
frameworkgroup: C1[X(C22H30O2)]
method: RPBEPBE
basis: SDD
operation: Freq
keyword: #pfreq=noraman
keyword: PBEPBE/SDD
title: #p freq=noraman PBEPBE/SDD
converged: YES YES NO NO
title: Mulliken charges:
elementType: O O C C C C C C C C C C C C C C C C C C C C C C H H H H H H H H H H H H H H H H H H H H H H H H H H H H H H
charge: -0.277582 -0.277576 0.217608 0.217602 -0.563493 -0.563512 0.248035 0.248041 -0.390473 -0.390477 0.077678 0.077684 0.200789 0.200789 -0.025617 -0.025612 -0.624856 -0.545510 -0.801815 -0.801817 -0.716862 -0.714009 -0.714025 -0.716843 0.225274 0.233452 0.225265 0.233484 0.222219 0.205961 0.222226 0.205945 0.205158 0.205162 0.251987 0.272082 0.234717 0.225047 0.235170 0.235180 0.234706 0.225052 0.214158 0.212812 0.213188 0.218650 0.210973 0.212105 0.218650 0.210984 0.212107 0.214159 0.212790 0.213190
chargesum: 0.00000
title: Mulliken charges with hydrogens summed into heavy atoms:
elementType: O O C C C C C C C C C C C C C C C C C C C C C C
charge: -0.277582 -0.277576 0.217608 0.217602 -0.104767 -0.104763 0.248035 0.248041 0.037707 0.037694 0.077678 0.077684 0.200789 0.200789 0.179541 0.179549 -0.372869 -0.273428 -0.106881 -0.106879 -0.076704 -0.072280 -0.072283 -0.076704
polarizability: 4.00395094e+02 -9.82506531e-04 2.35129116e+02 -9.87293679e-04 9.75300835e+00 1.57110612e+02
1716.lowfreq: -10.4746 -8.8371 -3.5909 -0.0013 -0.0001 0.0012 15.7495 15.9192 19.2329
frequency: 9.4856 13.8898 19.0168 29.5830 30.5748 49.0528 91.3145 94.2748 101.5321 113.3071 126.9534 132.6376 143.5855 157.2648 173.9784 195.4013 207.1273 221.5000 222.7048 243.1093 243.6817 245.7185 252.5741 266.6837 303.4891 316.3960 349.5017 353.3377 359.7076 363.6635 389.7335 408.8244 425.6531 425.7540 470.3939 500.2474 521.1871 534.5574 589.4785 617.3045 620.2343 630.5692 692.7785 704.3881 716.3414 731.2897 745.0070 754.7005 756.2881 778.6712 793.0857 793.8336 829.9159 848.7492 871.0218 879.7618 906.5636 909.2398 929.6651 937.5449 949.4469 949.7473 959.0293 962.4714 987.8945 988.0295 997.5319 1030.7939 1031.7156 1044.1391 1044.1497 1076.0094 1095.3379 1118.2593 1118.3837 1140.5754 1141.2460 1158.2391 1178.7821 1191.6140 1192.0677 1207.3862 1214.2543 1228.7464 1253.9468 1259.1718 1268.0074 1286.8738 1289.3227 1315.7493 1321.2176 1333.4849 1334.4791 1335.6156 1350.1654 1350.9030 1359.3220 1376.9252 1376.9375 1394.5767 1394.6853 1396.2211 1405.1341 1411.1694 1452.0874 1452.2894 1465.7386 1465.7835 1467.2657 1467.7615 1467.7743 1468.8127 1471.7582 1473.6151 1477.7836 1477.8236 1481.0295 1485.6493 1485.7599 1490.7679 1490.8112 1492.9197 1591.7200 1629.6905 1637.4960 1640.8578 2956.4997 2956.5191 2968.3822 2968.3920 2969.7797 2970.1803 2972.4896 2972.5144 2979.8737 2979.9505 2990.8061 2990.8997 3028.9548 3028.9849 3041.6586 3041.7677 3057.5552 3057.5868 3062.0837 3062.0897 3066.2843 3066.3127 3068.8148 3068.9544 3071.0750 3071.1054 3081.9156 3082.1212 3147.2980 3190.4665
redmass: 3.3308 2.4885 3.5579 3.9286 3.8230 4.5004 2.2002 2.1346 3.0828 2.0502 1.0603 1.3933 3.6081 2.9917 3.3399 3.1433 3.1194 1.1077 1.1727 2.0810 1.2574 1.0827 2.1540 2.6804 5.2619 4.9502 2.2521 2.1388 2.2582 2.2094 4.4291 4.5808 2.9785 6.1485 3.4112 2.6439 3.9070 2.8611 4.1814 4.1324 5.7986 5.3890 5.0615 6.3878 5.3096 5.2572 3.8995 1.4793 1.3184 4.4932 3.1854 3.4020 3.4818 1.4336 1.4976 2.4369 1.3253 1.2350 1.5586 1.4284 2.1355 2.2405 1.7070 1.7601 1.9648 1.9517 2.5307 1.9293 1.9365 1.4562 1.4573 2.6501 2.2213 1.7838 1.7859 2.4153 2.2176 4.8103 2.6295 1.9174 1.9261 1.4381 1.3436 1.4213 1.6562 1.5051 2.4855 1.1412 1.2849 1.7768 1.6576 1.7751 1.4582 2.0452 1.4095 1.3640 4.4312 1.2163 1.2162 1.2297 1.2165 1.8187 1.3294 2.1179 1.1055 1.0827 1.0486 1.0460 1.1897 1.0564 1.2297 1.1200 1.5050 1.2762 1.0543 1.0541 1.5053 1.0622 1.0516 1.0538 1.0539 3.4895 9.9956 8.4588 7.9636 7.9282 1.0787 1.0787 1.0354 1.0354 1.0377 1.0377 1.0389 1.0389 1.0623 1.0623 1.0605 1.0605 1.0991 1.0991 1.0980 1.0980 1.1008 1.1008 1.0997 1.0997 1.0999 1.0999 1.0985 1.0985 1.0992 1.0992 1.0972 1.0971 1.0924 1.0943
irintensity: 0.1295 0.0501 0.0452 1.2865 0.1307 0.0915 0.0035 0.0594 0.0021 0.0775 0.0175 0.9777 0.4465 1.1824 1.0223 0.8993 0.0413 0.0546 0.0729 0.8161 0.0100 0.2073 0.4472 1.3237 0.0093 5.9128 0.2122 0.2078 0.0776 0.0097 1.1248 3.0734 2.5523 0.8217 1.1150 6.0616 3.1636 2.1276 0.0133 12.3669 1.5125 0.2926 2.2324 0.8548 0.8250 3.1505 0.0282 1.0081 0.0473 4.3320 0.9989 2.9831 7.2620 27.6894 33.6071 82.8540 0.4665 7.7777 0.0779 2.2360 0.0342 0.2722 0.1286 7.3294 8.5877 1.9839 8.6039 37.4257 24.2111 0.3786 2.3579 0.3377 116.3207 2.1059 0.0979 5.1082 10.5047 3.2071 15.3877 2.9303 5.7225 9.2140 2.4038 0.3643 11.7622 33.1253 4.7725 6.9323 0.8188 13.0915 5.5676 4.5972 3.1982 4.4118 0.8013 3.2798 3.8507 6.6100 38.2276 46.6920 16.1662 93.3965 24.0252 47.0922 0.0019 6.1870 0.0464 8.5665 7.9650 22.4590 3.9286 0.6170 1.3185 3.8843 4.1204 0.4007 30.7904 30.1545 7.3142 32.5369 7.7250 1.8400 7.3346 1.6397 12.4107 25.8657 10.9943 21.5636 12.5976 51.2861 10.7999 80.9408 17.0286 46.0546 1.8026 26.3691 41.5867 46.0096 3.0312 4.7116 0.0946 41.2599 10.0154 53.0281 0.6474 6.7602 1.5712 72.5827 137.1597 133.0352 69.0318 41.6629 52.4831 0.4445 7.5466 0.0033
temp: 298.150 k
press: 1.00000 atm
elementType: 8 8 6 6 6 6 6 6 6 6 6 6 6 6 6 6 6 6 6 6 6 6 6 6 1 1 1 1 1 1 1 1 1 1 1 1 1 1 1 1 1 1 1 1 1 1 1 1 1 1 1 1 1 1
symmnumber: 1
zpe: 1214030.8 jmol-1
zpe.correction: 0.462400 hartree
zpe.thermalcorrener: 0.488655 hartree
zpe.thermalcorrenthalpy: 0.489599 hartree
zpe.thermalcorrgfe: 0.402400 hartree
zpe.sumelectzpe: -1004.982822 hartree
zpe.sumelectthermal: -1004.956567 hartree
zpe.sumelectthermalent: -1004.955622 hartree
zpe.sumelectthermalfe: -1005.042821 hartree
dipole: 0.0002 1.9348 0.8450
dipole: 2.1113
quadrupole: -123.0425 -139.2167 -149.1407
quadrupole: -0.0005 -0.0005 -0.2632
quadrupole: 14.0908 -2.0834 -12.0074 -0.0005 -0.0005 -0.2632
hfenergy: -1005.4452216 hartree
pointgroup: C01 [X(C22H30O2)]
dipole: -0.001871 0.7910212 -0.2534922 debye
polarizability: 400.3942893|0.3566327|236.2955732|-0.0816001|-1.6787407|155.944959 unknown
InChI: InChI=1S/C22H30O2/c1-13(2)7-9-19-15(5)17-11-18-16(6)20(10-8-14(3)4)24-22(18)12-21(17)23-19/h11-14H,7-10H2,1-6H3
charge 0 multiplicity 1
54 atoms
O  2.48768 -0.912763 0.379128
O  -2.480136 -0.923755 0.38092
C  1.206136 1.023877 0.27564
C  -1.207253 1.018527 0.276521
C  4.815439 -0.080091 0.346206
C  -4.811551 -0.101499 0.349836
C  3.352553 0.232601 0.329259
C  -3.350104 0.217781 0.33171
C  5.307678 -0.774014 -0.957501
C  -5.301815 -0.797046 -0.95376
C  2.618037 1.403724 0.263984
C  -2.620819 1.392138 0.265906
C  1.173066 -0.40768 0.346093
C  -1.167795 -0.412869 0.346941
C  6.81408 -1.159786 -0.963298
C  -6.806579 -1.189127 -0.9587
C  -0.002207 1.758281 0.238449
C  0.00436 -1.182031 0.385426
C  3.139669 2.814301 0.195312
C  -3.148735 2.800393 0.197543
C  7.739409 0.076864 -0.851392
C  7.159334 -2.210468 0.120502
C  -7.146916 -2.241387 0.125112
C  -7.736987 0.043667 -0.846028
H  5.369288 0.862795 0.50525
H  5.034572 -0.734327 1.212261
H  -5.369608 0.838739 0.509886
H  -5.026805 -0.757176 1.215772
H  4.698288 -1.684795 -1.116981
H  5.102767 -0.099697 -1.813415
H  -4.68865 -1.705159 -1.113993
H  -5.100353 -0.121573 -1.809582
H  7.005733 -1.629205 -1.951922
H  -6.99687 -1.659173 -1.947287
H  -0.004656 2.851724 0.185557
H  0.006795 -2.271773 0.441926
H  2.774635 3.417633 1.048604
H  4.242494 2.845562 0.209478
H  2.801701 3.320841 -0.729183
H  -2.81416 3.308189 -0.727499
H  -2.785283 3.405543 1.050223
H  -4.251667 2.826784 0.213084
H  8.798627 -0.211359 -0.985422
H  7.652639 0.557701 0.141304
H  7.492578 0.833566 -1.619939
H  6.494957 -3.092027 0.05089
H  7.059406 -1.789934 1.138849
H  8.202687 -2.560458 0.009922
H  -6.478693 -3.120021 0.055297
H  -7.048629 -1.820456 1.143448
H  -8.188739 -2.595971 0.014757
H  -8.795113 -0.248931 -0.979218
H  -7.65138 0.524776 0.146636
H  -7.493904 0.801443 -1.614711
