program: Gaussian 09
title: 000271793
version: EM64L-G09RevD.01
frameworkgroup: C1[X(C14H11Cl2I)]
method: RPBEPBE
basis: SDD
operation: Freq
keyword: #p
keyword: freq=noraman
keyword: PBEPBE/SDD
title: #p freq=noraman PBEPBE/SDD
converged: YES YES NO NO
title: Mulliken charges:
elementType: I Cl Cl C C C C C C C C C C C C C C H H H H H H H H H H H
charge: 0.048328 -0.049823 -0.050715 -0.290939 0.610972 0.593184 -0.865495 -0.358845 -0.354837 -0.375242 -0.359923 -0.236606 -0.231905 -0.253368 -0.236467 -0.230108 -0.230162 0.296633 0.284222 0.325724 0.250908 0.258012 0.256881 0.258389 0.233601 0.233484 0.236581 0.237515
chargesum: 0.00000
title: Mulliken charges with hydrogens summed into heavy atoms:
elementType: I Cl Cl C C C C C C C C C C C C C C
charge: 0.048328 -0.049823 -0.050715 0.005694 0.610972 0.593184 -0.255548 -0.358845 -0.354837 -0.124334 -0.101911 0.020275 0.026484 -0.019767 -0.002983 0.006473 0.007353
polarizability: 2.22546434e+02 1.63616122e+01 1.83705954e+02 4.50087303e+00 -2.38778148e+01 1.53743499e+02
1716.lowfreq: -10.7079 -5.5764 -0.0025 -0.0021 -0.0019 5.9181 24.8188 28.4713 51.6061
frequency: 24.7482 28.4010 51.5936 56.6893 64.4821 125.7817 137.5273 157.5590 167.9729 204.7397 253.1193 263.7330 306.0895 349.2526 386.3173 413.8725 439.7098 446.8846 467.7331 500.2395 510.1967 564.2294 595.5097 629.7531 664.5887 672.2844 730.1581 732.3108 753.1251 764.0265 769.7363 825.5912 867.6935 875.7796 889.2036 948.2796 955.0188 986.8640 990.6062 1012.7628 1013.3947 1033.2102 1040.0748 1051.7834 1106.3032 1121.9903 1146.4753 1172.0840 1176.0469 1184.3117 1198.8763 1224.5152 1249.0597 1281.0414 1293.2090 1333.4476 1369.4498 1381.9276 1423.9618 1425.7918 1448.9727 1456.7352 1466.7202 1573.3428 1576.1379 1600.3740 1605.6422 3022.5750 3062.1464 3134.3623 3136.7039 3143.5200 3146.4126 3149.7455 3161.1606 3163.4362 3175.9818 3176.4810
redmass: 11.8489 10.5916 7.9260 6.8681 7.2204 7.0573 5.3499 5.7684 9.6012 4.5941 4.2474 4.7560 4.8555 6.2623 9.6425 8.5314 3.6022 3.3536 4.1981 5.1952 4.1961 3.9633 4.3148 4.8629 4.9502 5.6919 4.7024 3.9139 1.6197 1.2687 2.0140 2.5999 1.4108 1.5024 1.9705 1.3880 1.3834 1.3321 1.3416 6.5414 6.8785 3.2901 2.1993 2.4272 1.3826 1.7294 1.4107 1.1283 1.0897 2.1622 1.6028 1.3022 1.4541 1.5195 1.2812 1.6508 7.4848 4.4690 2.1807 2.1153 1.2177 2.2858 2.1984 6.0874 5.9138 6.9828 7.1010 1.0822 1.0574 1.0860 1.0858 1.1078 1.0904 1.0907 1.0952 1.0951 1.0996 1.0999
irintensity: 0.1383 0.3248 0.6133 0.2423 0.1311 0.2745 0.0652 0.0508 2.3385 0.9154 1.8231 1.2912 2.7969 1.8244 7.6534 6.0224 1.8769 9.9244 8.2390 14.8300 1.1837 27.0935 16.6284 3.3194 20.3336 12.7516 5.7429 15.3333 56.9307 64.8033 23.3597 7.1229 0.1721 1.0827 8.9182 0.6077 2.0212 0.0312 0.4194 12.3674 59.7409 11.3989 11.9627 11.4882 11.9029 1.3508 3.1291 1.8324 1.1180 0.2713 14.0797 11.0555 15.1362 5.2948 13.2010 3.0361 2.5745 1.9470 34.5828 12.3908 20.0515 31.7767 31.2976 11.3599 6.9253 2.1799 2.0383 1.2846 8.2320 0.4131 1.0255 1.6288 6.8766 11.1421 12.9673 15.0044 16.5180 10.9002
temp: 298.150 k
press: 1.00000 atm
elementType: 53 17 17 6 6 6 6 6 6 6 6 6 6 6 6 6 6 1 1 1 1 1 1 1 1 1 1 1
symmnumber: 1
zpe: 538388.7 jmol-1
zpe.correction: 0.205061 hartree
zpe.thermalcorrener: 0.220893 hartree
zpe.thermalcorrenthalpy: 0.221837 hartree
zpe.thermalcorrgfe: 0.158098 hartree
zpe.sumelectzpe: -1470.520204 hartree
zpe.sumelectthermal: -1470.504372 hartree
zpe.sumelectthermalent: -1470.503428 hartree
zpe.sumelectthermalfe: -1470.567168 hartree
dipole: -1.8696 2.0995 -3.2424
dipole: 4.2914
quadrupole: -121.3014 -119.6437 -125.6361
quadrupole: 7.4074 4.0273 -2.3509
quadrupole: 0.8923 2.5500 -3.4424 7.4074 4.0273 -2.3509
hfenergy: -1470.7252653 hartree
pointgroup: C01 [X(C14H11Cl2I1)]
dipole: 0.1018188 -1.4365215 -0.8812943 debye
polarizability: 218.2010622|-13.2011793|193.3930055|23.8288133|7.3570323|148.4018203 unknown
InChI: InChI=1S/C14H11Cl2I/c15-13-7-3-1-5-10(13)12(9-17)11-6-2-4-8-14(11)16/h1-8,12H,9H2
charge 0 multiplicity 1
28 atoms
I  -1.323342 3.656141 -1.106443
Cl -0.771681 -0.35307 2.650966
Cl 2.616104 2.002477 1.355988
C  -0.00087 0.963304 -0.073411
C  -1.301876 0.162424 -0.068085
C  1.243113 0.053579 -0.153805
C  0.149087 1.992585 -1.213475
C  -1.748186 -0.491009 1.108072
C  2.479092 0.424557 0.430711
C  -2.114027 0.006296 -1.221491
C  1.21977 -1.172335 -0.870161
C  -2.926743 -1.258092 1.161916
C  3.638387 -0.367786 0.338706
C  -3.301539 -0.756922 -1.1985
C  2.368198 -1.984194 -0.983604
C  -3.710731 -1.39265 -0.005703
C  3.580366 -1.584389 -0.37745
H  0.064332 1.519294 0.880344
H  0.02717 1.561549 -2.218777
H  1.118361 2.506157 -1.142632
H  -1.826728 0.507351 -2.15117
H  0.277166 -1.495281 -1.324893
H  -3.225197 -1.736888 2.098852
H  4.565758 -0.04026 0.817305
H  -3.906846 -0.847816 -2.106378
H  2.315938 -2.926829 -1.53836
H  -4.631584 -1.984375 0.024828
H  4.476113 -2.20942 -0.454951
