program: Gaussian 09
title: 000271840
version: EM64L-G09RevD.01
frameworkgroup: C1[X(C18H14N4O7)]
method: RPBEPBE
basis: SDD
operation: Freq
keyword: #p
keyword: freq=noraman
keyword: PBEPBE/SDD
title: #p freq=noraman PBEPBE/SDD
converged: YES YES NO NO
title: Mulliken charges:
elementType: O O O O O O O N N N N C C C C C C C C C C C C C C C C C C H H H H H H H H H H H H H H
charge: -0.184639 -0.218770 -0.152378 -0.205646 -0.209321 -0.201878 -0.201439 -0.294046 -0.322123 0.021761 0.024374 0.067118 0.103598 -0.718678 0.247002 0.188671 0.474086 0.486624 -0.768814 -0.312311 -0.295711 -0.312343 -0.317974 -0.381119 -0.425474 0.404761 -0.371161 -0.367797 0.398227 0.265847 0.245395 0.248374 0.264226 0.288454 0.246978 0.303173 0.245798 0.282864 0.289547 0.290915 0.289603 0.292081 0.292146
chargesum: 0.00000
title: Mulliken charges with hydrogens summed into heavy atoms:
elementType: O O O O O O O N N N N C C C C C C C C C C C C C C C C C C
charge: -0.184639 -0.218770 -0.152378 -0.205646 -0.209321 -0.201878 -0.201439 -0.294046 -0.322123 0.021761 0.024374 0.067118 0.103598 0.040937 0.247002 0.188671 0.474086 0.486624 0.030844 -0.009137 -0.049914 -0.029478 -0.028427 -0.090204 -0.135871 0.404761 -0.079080 -0.075652 0.398227
polarizability: 4.54175021e+02 -6.27391365e-01 2.73295127e+02 -2.15101581e+00 -4.72516521e+00 1.27056603e+02
1716.lowfreq: -4.8024 -0.0006 0.0002 0.0004 3.1689 8.2485 21.9539 25.4886 38.7393
frequency: 21.8445 25.4518 38.7130 41.8985 52.7611 62.5362 68.2751 71.7516 82.5553 101.1217 125.3012 145.2701 152.5567 172.4317 185.7128 188.2201 200.0591 211.4220 239.0078 255.5312 270.5138 285.8369 306.1463 321.6609 332.0062 370.2959 391.7068 397.3874 408.6134 416.2980 418.0975 451.9717 476.2036 500.9627 506.4602 512.0944 522.2400 544.1842 554.7336 584.9509 624.2631 627.9165 636.1306 661.1716 665.5660 672.2780 687.1325 714.0831 730.4099 739.8669 742.2032 764.7974 783.9425 795.7129 822.6862 826.2751 833.3604 858.2711 862.5800 896.4850 954.9708 976.8932 982.2417 987.6201 988.8406 997.2498 1002.6737 1004.9023 1019.6737 1047.8846 1095.0714 1096.0572 1099.5263 1101.5151 1130.2335 1131.4807 1149.5915 1178.3146 1189.0783 1192.1144 1194.7931 1200.0340 1222.6676 1230.3591 1306.4561 1310.6421 1327.1885 1341.3539 1362.6350 1367.6884 1375.5819 1396.8356 1399.8344 1402.3625 1426.8610 1434.2899 1440.2583 1451.2736 1474.9468 1482.7717 1486.8621 1493.3939 1592.4284 1597.5336 1608.4785 1611.9095 1638.4227 1642.1346 1693.6363 2984.2217 3011.7113 3066.4135 3108.6808 3124.2699 3128.4679 3174.9715 3181.3326 3181.8254 3182.5860 3192.9387 3201.6592 3206.4308 3211.5232
redmass: 9.6737 5.6676 7.6642 9.8771 8.7533 4.8482 6.4837 6.6154 5.6540 9.1551 8.6973 7.4314 6.8618 9.5389 4.2908 1.1353 4.4306 1.4554 6.8496 3.3573 5.2905 3.7588 4.5376 4.0434 6.4134 6.3838 7.1761 7.0630 3.1181 3.9248 4.8254 8.6322 4.5074 3.6069 6.8956 6.8313 4.1588 4.1907 4.2325 5.5443 7.0806 7.2099 9.2518 4.4305 4.6203 7.8862 7.9807 6.8753 4.6803 5.2216 5.4851 5.0508 7.8404 6.1792 4.5962 1.3409 1.2594 1.7400 1.5807 3.9585 2.1164 1.4779 1.3817 2.0117 1.6564 1.3432 2.9383 3.2149 1.7007 4.6151 2.6705 2.4494 3.0451 3.1111 1.4024 1.4949 2.7161 3.7739 1.7137 2.0802 3.3027 3.8309 3.5964 3.0335 1.3041 1.3901 4.8914 5.8302 8.0933 8.4910 1.2469 2.7726 1.7314 11.1417 3.6401 3.5143 1.0822 1.0610 1.0595 1.0975 2.2095 2.5895 7.9596 8.0339 6.2330 6.1675 9.6991 10.8107 12.1060 1.0375 1.0360 1.0959 1.0998 1.1009 1.1003 1.0883 1.0912 1.0900 1.0905 1.0960 1.0960 1.0963 1.0949
irintensity: 0.5338 0.6784 0.2081 1.8616 0.7859 2.8297 3.3491 0.2968 0.9721 3.7965 7.0654 0.2282 2.2378 2.2311 2.7866 0.6972 0.3771 0.5084 0.8536 1.7922 2.1455 2.7961 4.8115 2.2741 2.0068 1.7947 1.8261 5.0299 1.2223 1.6102 14.6827 6.4293 15.4506 21.0085 5.1438 1.2284 6.9625 0.3267 17.4939 27.5492 0.5308 0.1396 0.9113 15.3247 30.7565 1.0395 2.7368 0.7519 2.7401 11.3402 8.5040 31.1664 36.5229 59.5946 8.4051 7.7927 0.0690 46.7367 65.8897 49.3424 9.3608 4.0131 10.0543 2.9768 0.2317 1.0761 0.1039 5.4522 2.2327 4.1733 93.0806 18.7138 130.6651 0.7200 23.3763 62.8415 175.8538 151.9775 323.5033 258.6397 9.1261 31.6133 543.9402 204.5509 9.6001 56.6213 754.4867 223.1687 89.0064 96.5154 73.4188 9.7946 49.8109 4.2521 57.6382 27.3312 27.8548 19.2302 19.4424 0.5500 191.8644 42.8635 2.6233 5.7449 191.1372 132.7482 283.8123 219.2879 115.5411 2.5959 8.6074 1.9180 10.5855 9.3752 4.5823 5.8651 1.7903 1.0950 1.6299 15.4612 1.7037 0.6921 3.1104
temp: 298.150 k
press: 1.00000 atm
elementType: 8 8 8 8 8 8 8 7 7 7 7 6 6 6 6 6 6 6 6 6 6 6 6 6 6 6 6 6 6 1 1 1 1 1 1 1 1 1 1 1 1 1 1
symmnumber: 1
zpe: 794060.3 jmol-1
zpe.correction: 0.302442 hartree
zpe.thermalcorrener: 0.327976 hartree
zpe.thermalcorrenthalpy: 0.328921 hartree
zpe.thermalcorrgfe: 0.244831 hartree
zpe.sumelectzpe: -1437.702910 hartree
zpe.sumelectthermal: -1437.677376 hartree
zpe.sumelectthermalent: -1437.676431 hartree
zpe.sumelectthermalfe: -1437.760522 hartree
dipole: -0.9044 5.8538 3.2174
dipole: 6.7407
quadrupole: -261.6544 -159.5313 -169.4220
quadrupole: -10.8402 -5.3496 -2.0365
quadrupole: -64.7851 37.3379 27.4472 -10.8402 -5.3496 -2.0365
hfenergy: -1438.005352 hartree
pointgroup: C01 [X(C18H14N4O7)]
dipole: -0.370166 -2.2886533 -1.2876504 debye
polarizability: 454.1644894|-0.718115|273.3704303|2.7762248|-3.3988893|126.9918309 unknown
InChI: InChI=1S/C18H14N4O7/c1-11(23)18(2)16(24)19(12-3-7-14(8-4-12)21(26)27)17(25)20(18)13-5-9-15(10-6-13)22(28)29/h3-10H,1-2H3
charge 0 multiplicity 1
43 atoms
O  1.533935 -2.6788 -0.915872
O  0.184893 1.678639 0.277621
O  -1.233042 -2.134481 1.835268
O  -6.619394 2.924657 0.104757
O  -7.382866 0.774288 0.180607
O  7.562463 0.336428 0.568259
O  6.995071 2.444614 -0.096238
N  -1.057409 -0.298534 -0.242881
N  1.236142 -0.405195 -0.247295
N  -6.430892 1.646569 0.112199
N  6.70099 1.220843 0.190763
C  -0.730164 -1.716076 -0.534472
C  0.81988 -1.698604 -0.600747
C  -1.276007 -2.227131 -1.888375
C  0.099553 0.470488 -0.029037
C  -1.053682 -2.649531 0.708845
C  -2.390806 0.199148 -0.125294
C  2.605866 0.017977 -0.133651
C  -1.042536 -4.141035 0.457456
C  -2.656573 1.599554 -0.138111
C  -3.48255 -0.70845 -0.017057
C  3.584598 -0.917699 0.292825
C  2.975884 1.349917 -0.454832
C  -3.97664 2.071124 -0.056709
C  -4.802338 -0.240011 0.060434
C  -5.041002 1.149884 0.034838
C  4.929642 -0.525124 0.398206
C  4.320381 1.745892 -0.343335
C  5.281131 0.803594 0.079415
H  -0.773725 -3.172554 -2.148498
H  -2.364699 -2.389927 -1.870166
H  -1.052446 -1.49201 -2.680258
H  -1.142962 -4.675635 1.413934
H  -0.100981 -4.43287 -0.044984
H  -1.869912 -4.437239 -0.214206
H  -1.831677 2.309487 -0.191497
H  -3.316584 -1.785125 0.041837
H  3.299492 -1.943639 0.531043
H  2.220955 2.071167 -0.769826
H  -4.192633 3.14251 -0.065702
H  -5.646099 -0.928623 0.151132
H  5.703028 -1.224224 0.725558
H  4.633716 2.765234 -0.581746
