program: Gaussian 09
title: 000271791
version: EM64L-G09RevD.01
frameworkgroup: C1[X(C14H11Cl2I)]
method: RPBEPBE
basis: SDD
operation: Freq
keyword: #p
keyword: freq=noraman
keyword: PBEPBE/SDD
title: #p freq=noraman PBEPBE/SDD
converged: YES YES NO NO
title: Mulliken charges:
elementType: I Cl Cl C C C C C C C C C C C C C C H H H H H H H H H H H
charge: 0.051609 -0.053758 -0.055785 -0.317748 0.515342 0.578722 -0.855631 -0.395227 -0.374830 -0.362240 -0.359293 -0.219464 -0.226486 -0.231674 -0.237163 -0.111990 -0.229073 0.278850 0.285467 0.322368 0.243191 0.246816 0.261202 0.256210 0.256130 0.259684 0.235622 0.239151
chargesum: 0.00000
title: Mulliken charges with hydrogens summed into heavy atoms:
elementType: I Cl Cl C C C C C C C C C C C C C C
charge: 0.051609 -0.053758 -0.055785 -0.038899 0.515342 0.578722 -0.247796 -0.152036 -0.128015 -0.362240 -0.098091 0.036746 0.029644 0.028010 -0.001541 -0.111990 0.010078
polarizability: 2.33795131e+02 -1.28609478e+01 1.98115064e+02 1.06187472e+01 1.78058320e+01 1.37026164e+02
1716.lowfreq: -9.3700 -3.6751 -0.8056 -0.0020 -0.0015 -0.0013 20.9520 27.7208 43.1710
frequency: 20.9382 27.6719 43.1538 51.2178 65.9024 114.3560 141.0254 157.7933 168.1485 187.2420 250.4893 294.3427 308.2027 337.2341 386.7039 403.1696 408.1244 446.6426 476.1686 492.5447 505.3936 562.4354 621.0844 625.2627 641.5847 671.0669 723.4468 731.8691 756.0549 763.9761 805.7029 829.5073 850.9325 872.5579 889.8522 950.4325 955.5467 966.8430 991.5544 1000.0921 1011.6135 1030.4630 1040.8048 1076.0253 1099.1344 1118.7599 1140.2546 1171.2734 1183.6428 1190.6166 1199.2357 1225.9406 1249.8985 1291.0965 1297.1820 1334.0296 1370.3036 1382.9362 1400.0150 1425.0603 1447.8873 1455.9821 1481.3471 1573.0683 1587.8555 1599.5362 1603.1579 3015.5119 3058.9267 3132.1047 3137.2112 3140.1473 3144.0165 3149.1748 3162.9032 3170.8313 3173.8965 3177.0911
redmass: 9.2510 10.1863 5.2026 8.3225 5.7247 11.4301 5.2170 8.7528 9.5611 3.6221 5.1118 5.1037 5.5545 7.1811 7.6816 5.6695 2.8787 3.5210 4.4170 3.7179 4.4826 3.9449 5.2310 6.0105 3.8292 5.7938 4.0425 3.9090 3.0023 1.2871 2.0968 1.2605 2.0401 1.4226 1.9589 1.3683 1.3780 1.3776 1.3490 4.2397 6.9552 3.7334 2.2608 2.6414 1.3025 1.7222 1.3079 1.2027 1.9128 1.1368 1.6344 1.3754 1.5052 1.3386 1.2759 1.7357 6.9741 5.3756 2.3270 2.1602 1.1245 2.3372 2.4122 6.0654 7.2428 6.7643 6.3339 1.0829 1.0575 1.0900 1.0858 1.1026 1.0947 1.0904 1.0952 1.0952 1.0963 1.0998
irintensity: 0.3230 0.2650 0.1946 0.1735 0.0418 0.6898 0.1919 0.0387 2.8310 0.4179 1.9953 1.4413 0.1544 3.6899 7.7883 3.3056 0.3681 14.3899 4.3680 10.6260 17.5921 49.3410 5.4380 4.3121 11.5836 14.6007 8.0066 12.7895 8.2875 71.9130 19.1612 0.1535 32.2065 3.6314 20.5857 0.3022 1.4652 0.1615 0.8401 43.2539 46.1382 3.5917 11.7106 43.8840 4.9876 9.0197 7.2994 1.8954 0.6754 1.0734 14.8379 10.4202 12.4060 12.2335 2.7434 2.1085 4.5843 0.5355 5.7891 26.1496 24.5075 32.3203 74.4518 11.8968 2.7567 1.9566 9.5697 1.2087 8.5780 6.9125 0.4414 6.8956 5.5470 4.6287 11.9524 6.3672 0.2385 15.2454
temp: 298.150 k
press: 1.00000 atm
elementType: 53 17 17 6 6 6 6 6 6 6 6 6 6 6 6 6 6 1 1 1 1 1 1 1 1 1 1 1
symmnumber: 1
zpe: 537991.8 jmol-1
zpe.correction: 0.204910 hartree
zpe.thermalcorrener: 0.220833 hartree
zpe.thermalcorrenthalpy: 0.221777 hartree
zpe.thermalcorrgfe: 0.157203 hartree
zpe.sumelectzpe: -1470.520881 hartree
zpe.sumelectthermal: -1470.504958 hartree
zpe.sumelectthermalent: -1470.504014 hartree
zpe.sumelectthermalfe: -1470.568588 hartree
dipole: 2.0603 -2.9839 -1.5282
dipole: 3.9349
quadrupole: -134.3223 -126.3523 -121.8490
quadrupole: -9.8853 -1.1381 2.1342
quadrupole: -6.8145 1.1556 5.6588 -9.8853 -1.1381 2.1342
hfenergy: -1470.7257911 hartree
pointgroup: C01 [X(C14H11Cl2I1)]
dipole: -1.1118417 0.9482542 -0.5111765 debye
polarizability: 235.7766496|-5.2452796|193.9046313|-15.0220753|-19.8540629|139.2550778 unknown
InChI: InChI=1S/C14H11Cl2I/c15-11-7-5-10(6-8-11)13(9-17)12-3-1-2-4-14(12)16/h1-8,13H,9H2
charge 0 multiplicity 1
28 atoms
I  0.743947 -3.989532 -0.230533
Cl -3.049418 -1.54757 1.833951
Cl 5.105814 1.780509 -0.177344
C  -0.364173 -1.061648 0.23715
C  1.007248 -0.397776 0.099375
C  -1.523299 -0.079357 -0.034863
C  -0.612027 -2.285555 -0.671641
C  1.511733 0.347396 1.195852
C  1.785234 -0.463615 -1.082472
C  -2.780478 -0.20738 0.606315
C  -1.398207 0.973666 -0.980456
C  2.753359 1.014477 1.124266
C  3.033262 0.193601 -1.175785
C  -3.864874 0.653023 0.351351
C  -2.469898 1.847261 -1.261324
C  3.496609 0.927396 -0.068748
C  -3.706056 1.69005 -0.594929
H  -0.470875 -1.411616 1.281255
H  -0.469319 -2.072674 -1.74214
H  -1.615715 -2.70166 -0.503799
H  0.928564 0.408291 2.122393
H  1.441773 -1.047997 -1.942374
H  -0.435513 1.115267 -1.482507
H  3.135348 1.583203 1.976665
H  3.63251 0.128701 -2.088366
H  -4.811621 0.514111 0.880809
H  -2.338589 2.651625 -1.99257
H  -4.541938 2.366303 -0.80193
