program: Gaussian 09
title: 000271810
version: EM64L-G09RevD.01
frameworkgroup: C1[X(C20H15NO2)]
method: RPBEPBE
basis: SDD
operation: Freq
keyword: #p
keyword: freq=noraman
keyword: PBEPBE/SDD
title: #p freq=noraman PBEPBE/SDD
converged: YES YES NO NO
title: Mulliken charges:
elementType: O O N C C C C C C C C C C C C C C C C C C C C H H H H H H H H H H H H H H H
charge: -0.193384 -0.217931 -0.455995 0.134600 0.129060 0.200870 0.225491 0.326171 -0.565882 -0.179137 -0.363883 0.448404 0.251709 -0.575782 -0.779137 0.254474 -0.344279 -0.029510 -0.380579 -0.826431 -0.369232 -0.233069 -0.228752 0.308146 0.254679 0.230232 0.282217 0.278092 0.248803 0.207839 0.230317 0.283859 0.227636 0.228463 0.229176 0.287070 0.237597 0.238078
chargesum: 0.00000
title: Mulliken charges with hydrogens summed into heavy atoms:
elementType: O O N C C C C C C C C C C C C C C C C C C C C
charge: -0.193384 -0.217931 -0.147848 0.134600 0.129060 0.200870 0.225491 0.326171 -0.311203 -0.179137 -0.133651 0.448404 0.251709 -0.293565 -0.044403 0.254474 -0.113962 -0.029510 -0.096720 -0.141155 -0.082162 0.004528 0.009326
polarizability: 4.12300652e+02 2.00782618e+01 2.68329796e+02 -3.02895397e+00 -1.37315639e+01 1.19625670e+02
1716.lowfreq: -8.6970 -5.5093 -2.7592 -0.0006 0.0008 0.0009 26.9876 43.6864 60.0181
frequency: 26.9176 43.6438 60.0066 63.4248 92.2568 105.4814 110.8005 127.3872 167.3795 173.6106 198.1054 214.3847 232.0413 261.2117 271.2854 321.5797 354.1462 363.8731 369.5351 402.1119 429.3538 434.5150 440.9416 457.1390 473.7197 490.0195 535.7661 571.0742 571.1538 590.9347 603.7275 635.0955 660.7073 672.1669 680.7253 700.7437 727.3176 759.9302 763.4130 790.7429 798.2284 803.0940 830.5509 834.8437 871.9823 886.2801 916.3938 932.4966 940.2465 962.6062 990.5454 994.3189 1008.6834 1012.1933 1020.8895 1040.1734 1042.5449 1047.5875 1074.9311 1121.1425 1128.6000 1147.1470 1170.5238 1216.4434 1225.3668 1238.1144 1257.7779 1267.8523 1297.2143 1305.2591 1314.5711 1338.2512 1397.2415 1398.0748 1400.4873 1411.1885 1436.1231 1440.4505 1446.2992 1459.2492 1467.5785 1469.3134 1471.3828 1477.4600 1491.4953 1507.8638 1538.0963 1550.3651 1571.6236 1593.4149 1602.7895 1609.0885 1632.8860 2974.6288 2988.7352 3051.2533 3075.1854 3083.9127 3103.0203 3122.1174 3134.5213 3140.1517 3147.2047 3149.6326 3154.6961 3161.0137 3170.3663 3593.8057
redmass: 5.7796 5.7690 2.2685 1.3626 6.0452 1.2853 2.3650 3.8917 5.5372 5.9312 3.8307 4.1945 4.8311 4.3092 5.0161 4.4255 4.0909 6.0373 4.9394 3.6993 3.8215 4.1373 4.2137 9.1259 7.1827 4.3714 4.0413 1.2380 5.8327 2.7806 5.5006 4.9748 4.1017 4.5817 5.8496 6.4331 3.6478 5.2368 3.6483 2.3757 2.7349 1.4040 4.6594 3.9038 5.2132 1.4578 1.3622 1.6742 1.3537 2.2786 1.6063 1.3956 3.2589 1.3581 2.0118 1.5618 2.1225 1.5302 3.0699 2.0665 1.9964 1.6973 1.0861 2.2272 1.9173 1.4401 1.7977 2.7249 2.1050 2.8817 3.4231 3.2018 4.2952 2.0256 1.4396 1.9121 1.8074 2.5380 3.3497 1.4035 2.3978 2.1052 1.0583 1.2924 1.6799 7.0697 7.4879 7.2245 7.7021 6.0791 7.4953 6.9335 6.9473 1.0374 1.0390 1.0976 1.0978 1.0985 1.0970 1.0873 1.0861 1.0918 1.0969 1.0901 1.0914 1.0945 1.1002 1.0804
irintensity: 2.5091 0.4384 0.2173 0.8160 2.7007 3.1904 3.2915 0.9355 2.1696 1.6540 0.1742 4.3543 0.3561 4.3013 0.9762 2.2528 2.2865 18.0858 11.8109 4.8112 3.8655 2.6773 6.3061 0.2931 0.8400 6.0694 0.4010 72.3805 16.8915 32.6550 9.8460 1.3526 6.2491 4.3961 0.9129 1.3661 23.3133 1.6178 29.8710 36.9442 27.1230 48.8256 12.1937 2.0733 5.7100 11.2047 5.5326 6.3130 0.5948 10.8722 14.4744 3.0626 36.4085 0.1146 9.8448 14.9493 0.7434 10.0099 8.7263 42.6538 6.0813 7.3564 13.4175 22.9982 5.3859 29.0195 116.0584 37.3870 99.8969 341.0308 84.2948 150.3362 6.0647 7.5144 4.3292 17.0022 114.7341 0.2872 22.3479 57.6202 30.9632 60.5204 14.2733 6.0837 14.7823 73.1551 123.7448 171.7700 276.7522 11.1052 141.1782 13.1012 5.2419 45.9227 41.6271 21.6992 14.8202 15.6519 12.9693 9.0034 4.2802 14.8843 22.8576 7.0870 7.6724 2.5723 34.8034 87.0657
temp: 298.150 k
press: 1.00000 atm
elementType: 8 8 7 6 6 6 6 6 6 6 6 6 6 6 6 6 6 6 6 6 6 6 6 1 1 1 1 1 1 1 1 1 1 1 1 1 1 1
symmnumber: 1
zpe: 768050.0 jmol-1
zpe.correction: 0.292535 hartree
zpe.thermalcorrener: 0.311738 hartree
zpe.thermalcorrenthalpy: 0.312682 hartree
zpe.thermalcorrgfe: 0.244461 hartree
zpe.sumelectzpe: -974.786152 hartree
zpe.sumelectthermal: -974.766949 hartree
zpe.sumelectthermalent: -974.766005 hartree
zpe.sumelectthermalfe: -974.834226 hartree
dipole: 1.6559 3.7826 0.0408
dipole: 4.1294
quadrupole: -100.6784 -127.0075 -139.5465
quadrupole: 2.9810 4.8587 10.4588
quadrupole: 21.7324 -4.5967 -17.1357 2.9810 4.8587 10.4588
hfenergy: -975.0786867 hartree
pointgroup: C01 [X(C20H15N1O2)]
dipole: -0.7367191 1.2892596 0.6591397 debye
polarizability: 414.0689566|-13.5630563|221.5098725|-0.1491157|68.9146237|164.6772892 unknown
InChI: InChI=1S/C20H15NO2/c1-11-7-8-17-15(9-11)19(12(2)21-17)16-10-18(22)13-5-3-4-6-14(13)20(16)23/h3-10,21H,1-2H3
charge 0 multiplicity 1
38 atoms
O  1.114348 1.379099 1.96303
O  2.214027 -1.851896 -2.337879
N  -2.898886 2.043882 0.587288
C  -1.070922 0.757905 0.147692
C  -2.277462 -0.041472 -0.092482
C  -3.405025 0.791528 0.204208
C  -1.50525 2.041061 0.566455
C  0.30309 0.303115 -0.056318
C  -2.512506 -1.389587 -0.470349
C  1.384264 0.699695 0.921576
C  -4.733592 0.332181 0.113929
C  -3.835254 -1.877663 -0.567303
C  2.782835 0.231609 0.6619
C  0.632833 -0.559163 -1.09347
C  -0.762119 3.307321 0.885747
C  3.077114 -0.6364 -0.427178
C  -4.931496 -1.005471 -0.281401
C  1.981464 -1.075448 -1.347132
C  3.824151 0.644459 1.530105
C  -4.106207 -3.316909 -0.974447
C  4.402906 -1.081962 -0.637749
C  5.144817 0.200829 1.313637
C  5.435173 -0.663745 0.227883
H  -3.462514 2.857975 0.826559
H  -1.675752 -2.065006 -0.677876
H  -5.584858 0.981347 0.347063
H  -0.124458 -0.858166 -1.825678
H  -0.479317 3.343316 1.951901
H  0.173746 3.374866 0.308966
H  -1.375573 4.19616 0.646187
H  -5.953526 -1.39438 -0.365066
H  3.572885 1.304389 2.366485
H  -4.681798 -3.854288 -0.197193
H  -4.696806 -3.367275 -1.908929
H  -3.168354 -3.873432 -1.142144
H  4.594369 -1.751501 -1.48245
H  5.947121 0.521784 1.986601
H  6.461831 -1.008263 0.063131
