program: Gaussian 09
title: 000271779
version: EM64L-G09RevD.01
frameworkgroup: C1[X(C11H18O2)]
method: RPBEPBE
basis: SDD
operation: Freq
keyword: #pfreq=noraman
keyword: PBEPBE/SDD
title: #p freq=noraman PBEPBE/SDD
converged: YES YES NO NO
title: Mulliken charges:
elementType: O O C C C C C C C C C C C H H H H H H H H H H H H H H H H H H
charge: -0.280632 -0.228767 -0.078323 -0.348249 -0.478975 -0.575946 0.378467 -0.753129 0.141573 0.211484 -0.805647 -0.797047 -0.508666 0.252291 0.253310 0.222432 0.203029 0.223168 0.218039 0.210793 0.224740 0.218496 0.227669 0.258632 0.214905 0.239070 0.223977 0.221471 0.231378 0.241400 0.239055
chargesum: 0.00000
title: Mulliken charges with hydrogens summed into heavy atoms:
elementType: O O C C C C C C C C C C C
charge: -0.280632 -0.228767 0.173969 -0.094938 -0.053513 -0.134738 0.378467 -0.099100 0.141573 0.211484 -0.104442 -0.112529 0.203166
polarizability: 1.35362161e+02 -2.87130948e+00 1.39851068e+02 3.43983768e+00 4.14080205e+00 9.67699895e+01
1716.lowfreq: -8.5139 0.0003 0.0005 0.0007 5.3725 8.1949 22.8486 45.7656 80.3442
frequency: 22.8270 45.7581 80.3368 102.3342 105.4574 113.1122 134.5088 150.7739 187.3802 199.9198 210.4850 226.1777 254.8603 307.4660 328.0317 340.7576 372.0151 413.3694 475.6228 490.4743 518.1884 582.5592 671.8234 703.0232 760.1840 836.2958 849.3212 878.3317 909.4076 926.6410 954.3122 956.9290 968.8640 981.1970 1002.7931 1068.6911 1079.0695 1082.6199 1098.7733 1102.1100 1112.3370 1139.6145 1146.9165 1163.5107 1165.7280 1206.5871 1239.0916 1260.5305 1285.0551 1289.6292 1300.8924 1322.0855 1347.2674 1389.3981 1390.2139 1401.1324 1420.4374 1451.8448 1457.4418 1463.0447 1464.3608 1467.6777 1471.2497 1474.0585 1476.4022 1477.8353 1481.9225 1640.6358 1702.9324 2957.2023 2961.8235 2965.4311 2970.0653 2977.7009 2986.8694 3001.7297 3003.7661 3026.0755 3028.6679 3049.3114 3058.6516 3067.1083 3069.0471 3091.3182 3097.0045 3102.1788 3146.0776
redmass: 3.8572 3.8045 2.7740 1.1091 1.0593 2.2850 1.4285 2.6958 2.1487 2.5637 2.1292 1.3223 3.7501 3.0567 3.2344 2.8825 3.0970 2.5020 3.2736 2.6265 3.3126 3.4036 4.5626 5.1110 3.0664 2.8235 2.6349 3.2324 1.9941 1.9939 1.4036 1.4274 1.3729 3.2743 1.9122 1.5688 1.8653 2.0145 3.0756 1.8465 1.2824 2.6467 1.4570 2.8608 1.7089 1.5160 1.3790 3.3850 1.3323 1.5397 1.4601 1.4033 1.5062 1.2400 1.2168 1.2032 1.1786 1.0504 1.0783 1.0593 1.0527 1.0499 1.0799 1.0557 1.0649 1.0646 1.0508 8.8430 7.8709 1.0395 1.0395 1.0664 1.0362 1.0786 1.0678 1.0327 1.0800 1.0964 1.0954 1.0943 1.1019 1.0998 1.0992 1.0966 1.0957 1.1043 1.1046
irintensity: 0.8677 1.1317 0.4265 0.1868 0.7270 0.1057 1.1060 2.0130 0.8996 2.8947 4.6707 1.6653 7.7262 2.7150 4.1400 5.8879 1.2073 1.3506 2.2908 0.5391 1.4645 2.9252 4.3540 9.7423 5.8191 5.0611 2.9515 4.2388 2.0144 0.1651 4.5741 1.4659 1.0762 39.7415 5.8824 10.8710 20.8751 14.8663 184.2274 12.2214 1.0136 24.1529 11.4254 17.8860 17.3932 1.3304 0.4676 1.3811 2.1660 38.3410 16.7593 29.7139 1.9599 19.2701 12.6465 8.6948 19.4259 13.2463 9.1666 6.9543 6.0279 15.8213 2.5896 8.5718 2.9028 14.3722 24.3598 132.8589 2.0908 19.5993 71.8214 29.4435 25.4290 8.9354 32.2056 32.0162 23.9244 3.4887 50.3394 29.4036 11.1157 67.0879 47.6304 18.7259 26.1121 26.2959 17.0324
temp: 298.150 k
press: 1.00000 atm
elementType: 8 8 6 6 6 6 6 6 6 6 6 6 6 1 1 1 1 1 1 1 1 1 1 1 1 1 1 1 1 1 1
symmnumber: 1
zpe: 697797.7 jmol-1
zpe.correction: 0.265777 hartree
zpe.thermalcorrener: 0.281191 hartree
zpe.thermalcorrenthalpy: 0.282135 hartree
zpe.thermalcorrgfe: 0.222588 hartree
zpe.sumelectzpe: -579.379894 hartree
zpe.sumelectthermal: -579.364480 hartree
zpe.sumelectthermalent: -579.363536 hartree
zpe.sumelectthermalfe: -579.423083 hartree
dipole: -0.0994 -0.1670 -1.3907
dipole: 1.4042
quadrupole: -71.1749 -73.5971 -85.6837
quadrupole: 2.7155 1.5516 1.4051
quadrupole: 5.6437 3.2215 -8.8651 2.7155 1.5516 1.4051
hfenergy: -579.645671 hartree
pointgroup: C01 [X(C11H18O2)]
dipole: -0.0470831 0.0270646 0.5497751 debye
polarizability: 134.3426657|5.3029466|136.598663|7.6460041|-10.7316764|101.0418905 unknown
InChI: InChI=1S/C11H18O2/c1-7(2)9-6-5-8(3)10(9)11(12)13-4/h8,10H,5-6H2,1-4H3
charge 0 multiplicity 1
31 atoms
O  2.018034 -0.85709 1.027197
O  1.564324 -0.814609 -1.255781
C  0.439654 1.934574 -0.37003
C  0.185239 0.537044 0.302705
C  -0.988113 2.506412 -0.54972
C  -1.821932 1.275622 -0.981054
C  -1.22906 0.122043 -0.165806
C  1.40584 2.835095 0.41771
C  -1.85141 -1.050987 0.145546
C  1.284306 -0.436409 -0.095763
C  -1.213885 -2.131661 1.004715
C  -3.242902 -1.397867 -0.359324
C  3.133121 -1.792934 0.745349
H  0.855385 1.738405 -1.379592
H  0.214862 0.649565 1.403763
H  -1.018217 3.329525 -1.286325
H  -1.359095 2.901892 0.416991
H  -1.686032 1.094973 -2.067751
H  -2.903021 1.413468 -0.804215
H  1.011801 3.043603 1.430874
H  2.39983 2.36438 0.532896
H  1.549941 3.804078 -0.095305
H  -0.910871 -2.999909 0.384181
H  -0.322207 -1.780768 1.549307
H  -1.941732 -2.514019 1.747051
H  -3.651852 -0.641379 -1.047864
H  -3.226349 -2.367458 -0.8962
H  -3.951971 -1.518191 0.484602
H  3.596125 -1.98294 1.723889
H  3.852072 -1.33409 0.045787
H  2.745813 -2.725171 0.300163
