program: Gaussian 09
title: 000271830
version: EM64L-G09RevD.01
frameworkgroup: C1[X(C20H20O6S)]
method: RPBEPBE
basis: SDD
operation: Freq
keyword: #p
keyword: freq=noraman
keyword: PBEPBE/SDD
title: #p freq=noraman PBEPBE/SDD
converged: NO YES NO NO
title: Mulliken charges:
elementType: S O O O O O O C C C C C C C C C C C C C C C C C C C C H H H H H H H H H H H H H H H H H H H H
charge: 0.947460 -0.225777 -0.386293 -0.248502 -0.498934 -0.501754 -0.262869 0.026759 0.189487 0.272314 0.410731 0.038225 0.365423 -0.515470 -0.587435 -0.799385 -0.812126 0.176355 -0.063235 -0.231682 -0.236479 0.454411 -0.390593 -0.328068 -0.255265 -0.798058 -0.665704 0.283601 0.258472 0.296122 0.230699 0.229451 0.229327 0.232801 0.243315 0.283171 0.280777 0.245979 0.244822 0.232749 0.227465 0.238751 0.239561 0.229790 0.217440 0.232979 0.249190
chargesum: 0.00000
title: Mulliken charges with hydrogens summed into heavy atoms:
elementType: S O O O O O O C C C C C C C C C C C C C C C C C C C C
charge: 0.947460 -0.225777 -0.386293 -0.248502 -0.498934 -0.501754 -0.262869 0.026759 0.189487 0.272314 0.410731 0.038225 0.365423 -0.231868 -0.328963 -0.043113 -0.106682 0.176355 -0.063235 0.051489 0.044298 0.454411 -0.144614 -0.083245 0.204949 -0.089956 0.033905
polarizability: 6.14226250e+02 -8.26036622e+00 2.87074540e+02 9.55777672e+00 4.55730328e+00 1.63865279e+02
1716.lowfreq: -6.0574 -3.2943 0.0007 0.0013 0.0021 2.9895 7.0487 10.3360 19.7810
frequency: 6.9311 10.2708 19.7390 32.3979 35.0831 35.2807 42.8715 55.6832 72.4490 76.6518 94.5785 100.9360 107.3326 116.7259 129.5927 156.5087 167.1660 200.2007 207.2850 222.1978 234.6388 239.4746 262.7973 278.9991 283.7300 292.3291 308.0717 315.8893 326.5232 344.2545 376.7317 381.1586 401.8143 406.3281 416.3361 430.2937 440.0328 492.9340 506.9960 536.4905 547.2269 586.8166 596.8403 600.3252 619.7751 620.4851 659.9213 674.6200 704.6330 724.1436 732.3023 751.3944 778.0347 791.3697 815.9649 817.0160 825.7545 845.6347 855.7525 873.2768 898.5738 936.7097 954.3861 962.7827 982.5119 986.0699 991.2717 995.7049 1000.0040 1036.9885 1037.4517 1048.1457 1049.8208 1050.2214 1051.6529 1087.5635 1091.2418 1095.2832 1114.1655 1120.0594 1155.0637 1185.9079 1216.0726 1219.4743 1255.2313 1277.8899 1280.0282 1298.0639 1347.0537 1353.8225 1368.7281 1380.6671 1390.4720 1393.1306 1396.0295 1401.1032 1404.1334 1415.9762 1455.8472 1457.9155 1462.1728 1468.7990 1470.1142 1472.0153 1473.9244 1475.0851 1483.7294 1484.4161 1490.7572 1551.9759 1563.3014 1592.2919 1594.9214 1595.4014 1612.3234 2983.5820 2984.4364 2989.1035 2994.0655 3030.5579 3061.6980 3062.7316 3066.2468 3089.5393 3094.3026 3095.4385 3095.7327 3119.3174 3121.0906 3136.9275 3140.8294 3159.3344 3165.3682 3168.0833 3196.1183
redmass: 5.6202 5.8159 5.2801 3.2560 1.2898 2.7185 4.1840 4.8493 1.2957 6.8848 3.7846 2.8599 3.5506 4.3619 6.8336 5.8587 4.5449 1.2488 1.4025 6.7462 2.8929 2.7497 2.9452 6.2474 5.5850 4.5381 3.1407 6.2607 4.4780 7.5834 3.9075 6.6158 5.9404 2.8751 7.3316 6.3065 4.7378 4.5950 3.1670 4.4397 4.9262 6.0354 5.7173 6.3814 5.2658 6.9429 3.8547 5.0559 3.3249 8.5258 3.7929 4.4306 4.9430 3.2635 1.5438 9.8539 1.3917 1.2451 3.0353 1.4287 1.5792 15.3347 2.7743 1.2979 1.3984 1.9513 3.5215 2.6521 2.3262 1.6242 2.2841 1.5749 2.4720 1.6255 2.4625 3.7337 7.0379 2.2599 1.9632 1.2870 1.6844 1.1335 1.7240 3.0090 5.3867 1.1837 3.3086 1.2614 2.1002 2.3188 3.0352 4.3498 1.2324 3.0870 1.2509 1.3196 1.3270 2.9594 1.1182 1.4807 1.0442 1.0466 1.0462 2.3384 2.0406 1.1189 1.3766 1.0558 1.0470 8.3046 7.2376 6.7919 6.0613 7.5367 8.0349 1.0376 1.0380 1.0379 1.0362 1.0597 1.0971 1.0974 1.0970 1.0973 1.0990 1.1030 1.0988 1.0981 1.1060 1.0895 1.0895 1.0920 1.0955 1.0968 1.0943
irintensity: 1.2147 0.4273 1.6380 1.7725 0.3406 0.3899 1.0384 0.2753 0.5012 4.0645 6.9692 0.0238 1.8183 0.3351 1.5000 6.2806 17.9414 9.6782 3.0313 12.8694 1.5343 2.9449 0.1353 10.5686 12.6465 0.4891 16.8956 33.7947 0.9504 18.2028 1.2390 7.2683 3.3850 0.4898 58.2818 70.8636 65.4356 4.7362 80.2685 0.8578 1.9674 35.0500 9.1063 7.8581 0.5979 0.2780 7.3280 2.0458 0.4629 6.7457 2.8351 1.2834 2.5835 11.6874 4.0398 93.9025 22.5637 0.1952 3.8211 9.7191 34.8654 54.8924 2.6662 2.1095 0.1381 2.2190 14.9052 16.6139 3.3971 47.5951 199.4631 11.5060 107.6466 21.4680 45.2913 119.2713 9.3105 20.0242 86.5605 9.6423 55.6458 38.6614 82.6291 12.0363 239.7843 31.5904 132.0908 3.0524 11.2689 10.6199 49.2615 5.0807 26.0417 10.8824 6.8463 13.7837 58.6153 44.4896 49.3901 37.4677 15.8942 3.4543 14.4323 31.9494 20.8608 18.5399 3.2054 17.2754 31.2486 6.9896 130.1305 2.7765 4.6450 369.9814 9.6234 28.6011 2.9062 44.1641 24.6156 40.9494 0.1793 15.1011 28.7149 45.6156 17.9931 1.6188 15.4492 1.3036 26.6033 11.6171 13.2668 2.2914 0.4536 17.4177 1.1664
temp: 298.150 k
press: 1.00000 atm
elementType: 16 8 8 8 8 8 8 6 6 6 6 6 6 6 6 6 6 6 6 6 6 6 6 6 6 6 6 1 1 1 1 1 1 1 1 1 1 1 1 1 1 1 1 1 1 1 1
symmnumber: 1
zpe: 928756.4 jmol-1
zpe.correction: 0.353745 hartree
zpe.thermalcorrener: 0.381947 hartree
zpe.thermalcorrenthalpy: 0.382891 hartree
zpe.thermalcorrgfe: 0.288853 hartree
zpe.sumelectzpe: -1621.415229 hartree
zpe.sumelectthermal: -1621.387027 hartree
zpe.sumelectthermalent: -1621.386083 hartree
zpe.sumelectthermalfe: -1621.480121 hartree
dipole: 3.0368 -0.5538 -3.1548
dipole: 4.4138
quadrupole: -117.4575 -143.6685 -175.9182
quadrupole: -4.5318 -14.4533 -0.0185
quadrupole: 28.2239 2.0129 -30.2368 -4.5318 -14.4533 -0.0185
hfenergy: -1621.7689738 hartree
pointgroup: C01 [X(C20H20O6S1)]
dipole: 1.2143248 0.0899487 -1.238053 debye
polarizability: 614.1296721|2.558755|279.7064981|14.3682502|29.3880359|171.3298987 unknown
InChI: InChI=1S/C13H13O4.C7H7O2S/c1-4-16-13(15)12-8(3)11-7(2)5-9(14)6-10(11)17-12;1-6-2-4-7(5-3-6)10(8)9/h5-6H,4H2,1-3H3;2-5H,1H3
charge 0 multiplicity 1
47 atoms
S  2.925751 0.082739 1.253759
O  -2.740736 -0.841213 -0.592404
O  1.909332 0.650748 -0.438787
O  -5.046196 -2.139653 -0.863555
O  2.295553 -1.327503 1.767494
O  3.060164 1.34679 2.270861
O  -6.34582 -0.264468 -0.336923
C  -2.214161 1.358685 -0.042305
C  -3.663668 1.229831 -0.036894
C  -1.694168 0.07013 -0.386073
C  -1.297954 2.434791 0.212709
C  -3.934696 -0.102614 -0.37085
C  0.555588 0.842549 -0.269889
C  -0.338342 -0.239568 -0.497239
C  0.071371 2.146276 0.094287
C  -4.685258 2.29514 0.262016
C  -1.761603 3.827036 0.595717
C  -5.218173 -0.805055 -0.511431
C  4.571961 -0.223435 0.422478
C  5.503407 0.825631 0.391874
C  4.809518 -1.491829 -0.133974
C  7.043402 -0.685679 -0.805872
C  6.748696 0.576389 -0.227334
C  6.060525 -1.711692 -0.746078
C  -6.296544 -2.950697 -0.998926
C  8.380913 -0.945171 -1.473495
C  -6.726172 -3.511887 0.359378
H  0.031394 -1.236048 -0.746616
H  0.818893 2.925153 0.276636
H  -5.703139 1.885172 0.188249
H  -4.542171 2.704747 1.278645
H  -4.592816 3.139342 -0.445651
H  -2.400222 4.274447 -0.187962
H  -2.353343 3.813638 1.529299
H  -0.900095 4.496342 0.753411
H  5.270778 1.791973 0.849917
H  4.051931 -2.279182 -0.072932
H  7.498021 1.374962 -0.261064
H  6.276963 -2.692759 -1.184412
H  -7.08449 -2.315227 -1.440059
H  -6.006076 -3.746367 -1.703007
H  8.906934 -1.792651 -0.996197
H  8.249181 -1.205213 -2.540364
H  9.041194 -0.063666 -1.419963
H  -7.591456 -4.187359 0.22455
H  -5.906825 -4.087727 0.822604
H  -7.026244 -2.700648 1.043372
