program: Gaussian 09
title: 000271789
version: EM64L-G09RevD.01
frameworkgroup: C1[X(C14H12ClIO)]
method: RPBEPBE
basis: SDD
operation: Freq
keyword: #p
keyword: freq=noraman
keyword: PBEPBE/SDD
title: #p freq=noraman PBEPBE/SDD
converged: YES YES NO NO
title: Mulliken charges:
elementType: I Cl O C C C C C C C C C C C C C C H H H H H H H H H H H H
charge: 0.099492 -0.054741 -0.276636 -0.419068 0.431829 0.393903 0.566841 -0.500262 -0.360481 -0.534866 -0.425481 -0.378688 -0.134740 -0.732838 -0.222470 -0.218373 -0.238335 0.224003 0.223873 0.285020 0.259699 0.247155 0.228872 0.259713 0.294454 0.295069 0.228082 0.228613 0.230363
chargesum: 0.00000
title: Mulliken charges with hydrogens summed into heavy atoms:
elementType: I Cl O C C C C C C C C C C C C C C
charge: 0.099492 -0.054741 -0.276636 0.028807 0.431829 0.393903 0.566841 -0.215242 -0.100782 -0.534866 -0.196608 -0.118975 0.112415 -0.143316 0.005612 0.010240 -0.007973
polarizability: 2.99076204e+02 1.10775414e+01 1.81576689e+02 -6.86153860e+00 1.26647735e+01 8.28107311e+01
1716.lowfreq: -3.1963 -1.6059 -0.0004 0.0018 0.0018 6.1863 9.5084 23.4291 42.4471
frequency: 9.0274 23.3706 42.4291 48.5520 82.2810 105.6058 112.7997 124.5530 166.3792 202.0291 219.6308 260.6906 297.0795 304.0588 368.9881 400.9444 438.6600 454.9402 493.0711 538.2770 558.6593 559.8860 616.3303 635.0318 688.8313 700.4899 702.8218 740.5039 750.5893 801.5245 825.2067 854.5902 872.0090 902.6251 915.0088 927.3928 943.5354 978.5478 985.4011 990.0337 996.4285 1005.6627 1013.0702 1028.0427 1086.7778 1129.4367 1164.2332 1171.4689 1173.1409 1187.4979 1202.9738 1216.0429 1227.2858 1270.0209 1274.9936 1315.9234 1353.2085 1370.7431 1390.0311 1412.9314 1439.8721 1440.7611 1445.2631 1471.6020 1487.0897 1565.2929 1596.8082 1609.8454 1618.9569 2937.9029 3000.8000 3042.2822 3113.4646 3114.9394 3129.2314 3142.5233 3156.6834 3158.1299 3169.8234 3172.0516 3177.7800
redmass: 4.0261 6.2200 4.7866 5.0527 4.3206 4.4382 14.9852 7.5671 9.8652 3.3274 4.0537 4.3452 7.2607 6.7120 5.9090 2.8223 2.9869 3.4105 3.9532 6.0545 3.6156 6.3904 6.4585 6.6752 3.1949 3.7215 2.8164 2.0180 3.1419 1.3951 3.9218 1.2510 1.4666 3.5936 1.5309 1.4154 1.4900 1.3888 6.3660 5.9840 1.3580 2.9298 2.0929 2.1513 1.5623 1.7764 1.0805 1.6815 1.0690 1.1121 1.2327 1.7313 1.8437 2.1641 1.2698 1.3665 1.9008 4.2841 4.1559 2.2795 1.6130 1.8505 2.4487 1.1449 2.2628 6.6015 6.2134 6.8549 6.0845 1.0577 1.1031 1.0566 1.1081 1.0877 1.0867 1.0925 1.0881 1.0963 1.0996 1.0910 1.0963
irintensity: 0.4033 0.0508 0.5768 0.5579 1.2856 6.8142 0.5012 1.8078 0.9446 2.3306 4.8929 3.2388 3.9428 2.3598 1.1520 0.8585 6.5578 8.3425 7.3285 1.1164 4.6938 7.5985 0.4349 27.6389 1.1271 22.3091 59.1366 34.0459 48.0927 46.9454 4.9040 0.2092 9.9238 17.8480 1.2039 7.6247 15.9106 0.1588 107.7702 0.0622 0.2252 38.1063 16.0849 7.2540 6.6308 61.1708 0.0349 93.6932 1.5922 2.2962 2.2748 94.1759 12.2455 204.6714 27.7956 9.9762 9.1683 25.4652 19.9170 34.3285 78.1124 5.6641 98.5643 7.9413 13.2102 60.2239 0.6383 56.8630 4.1391 27.8054 28.2816 6.1301 2.2518 9.6091 0.5623 25.8164 6.6599 33.0282 11.7893 1.8723 11.6971
temp: 298.150 k
press: 1.00000 atm
elementType: 53 17 8 6 6 6 6 6 6 6 6 6 6 6 6 6 6 1 1 1 1 1 1 1 1 1 1 1 1
symmnumber: 1
zpe: 571955.0 jmol-1
zpe.correction: 0.217846 hartree
zpe.thermalcorrener: 0.233903 hartree
zpe.thermalcorrenthalpy: 0.234847 hartree
zpe.thermalcorrgfe: 0.168899 hartree
zpe.sumelectzpe: -1086.258508 hartree
zpe.sumelectthermal: -1086.242451 hartree
zpe.sumelectthermalent: -1086.241507 hartree
zpe.sumelectthermalfe: -1086.307456 hartree
dipole: 1.6547 -2.8565 0.2840
dipole: 3.3134
quadrupole: -106.1101 -118.5095 -124.9501
quadrupole: -3.7045 -0.3144 3.8865
quadrupole: 10.4132 -1.9863 -8.4269 -3.7045 -0.3144 3.8865
hfenergy: -1086.4763544 hartree
pointgroup: C01 [X(C14H12Cl1I1O1)]
dipole: 0.7419643 1.0714133 -0.0294649 debye
polarizability: 296.4177216|-21.2002967|181.8126089|6.6563196|19.5338453|85.2332937 unknown
InChI: InChI=1S/C14H12ClIO/c15-9-12-8-13(6-7-14(12)16)17-10-11-4-2-1-3-5-11/h1-8H,9-10H2
charge 0 multiplicity 1
29 atoms
I  -5.698576 1.297494 0.063156
Cl -3.399055 -3.371584 0.019196
O  0.521185 -0.070992 0.150046
C  1.537196 0.997992 0.143075
C  2.90966 0.358467 0.073045
C  -0.824822 0.313186 0.131567
C  -3.138695 -0.523323 0.081021
C  -1.750152 -0.758017 0.101775
C  -1.282512 1.652404 0.145765
C  -3.586483 0.829488 0.092711
C  4.011895 1.00088 0.688451
C  3.11852 -0.849126 -0.637164
C  -2.673742 1.900396 0.125559
C  -4.157351 -1.648332 0.048126
C  5.310269 0.452852 0.584127
C  4.414828 -1.401844 -0.732961
C  5.515434 -0.751249 -0.127722
H  1.439042 1.617702 1.057534
H  1.360036 1.648604 -0.740865
H  -1.372237 -1.783699 0.095549
H  -0.592669 2.499723 0.175333
H  -3.037142 2.932002 0.136268
H  3.85876 1.928647 1.25438
H  2.26173 -1.355788 -1.091744
H  -4.786543 -1.599049 -0.854584
H  -4.803525 -1.636259 0.940122
H  6.155486 0.958111 1.064597
H  4.566115 -2.340056 -1.278462
H  6.520348 -1.181131 -0.204203
