program: Gaussian 09
title: 000271801
version: EM64L-G09RevD.01
frameworkgroup: C1[X(C11H19ClN2O3)]
method: RPBEPBE
basis: SDD
operation: Freq
keyword: #p
keyword: freq=noraman
keyword: PBEPBE/SDD
title: #p freq=noraman PBEPBE/SDD
converged: YES YES NO NO
title: Mulliken charges:
elementType: Cl O O O N N C C C C C C C C C C C H H H H H H H H H H H H H H H H H H H
charge: -0.089432 -0.280558 -0.319941 -0.250407 -0.437996 -0.403736 -0.038742 -0.435826 -0.464812 0.054086 -0.451319 -0.479146 0.306893 0.286435 -0.336801 -0.762083 -0.547595 0.263339 0.204785 0.253806 0.224446 0.211283 0.241188 0.211812 0.238444 0.225433 0.198021 0.289076 0.293769 0.267498 0.240733 0.247379 0.247388 0.246133 0.265368 0.281078
chargesum: 0.00000
title: Mulliken charges with hydrogens summed into heavy atoms:
elementType: Cl O O O N N C C C C C C C C C C C
charge: -0.089432 -0.280558 -0.319941 -0.250407 -0.148920 -0.109967 0.224597 0.022765 -0.029083 0.295274 -0.001062 -0.055692 0.306893 0.286435 0.171430 -0.021183 -0.001148
polarizability: 1.84599137e+02 7.13036100e-01 1.44574791e+02 -3.65036648e-01 7.10312828e+00 1.21343097e+02
1716.lowfreq: -3.6911 0.0014 0.0018 0.0028 5.3807 10.2330 18.8652 26.2699 36.7423
frequency: 17.4940 25.8583 36.7355 43.7877 63.5098 70.4669 73.7503 94.5647 100.4217 119.1516 168.0215 197.5363 227.7555 235.5424 285.5382 312.9344 329.1340 339.3199 354.3964 387.3831 432.6420 436.3011 466.8238 480.5970 502.4300 532.9204 568.5644 594.6533 617.8513 654.1087 698.5689 714.9508 778.6889 808.5605 821.8308 841.2512 866.7361 905.0732 931.0343 937.3781 949.4377 982.7702 991.8337 1000.6151 1004.9888 1040.3387 1043.3297 1056.8852 1085.2503 1088.1232 1130.1046 1143.0794 1154.6404 1182.6306 1196.2902 1201.5386 1217.4796 1240.0186 1245.8895 1257.0191 1294.4838 1298.8022 1302.6108 1312.8621 1327.8736 1336.8305 1349.9229 1360.3688 1365.0657 1373.7115 1385.0204 1435.8106 1439.5525 1452.3937 1453.9423 1456.8175 1457.4657 1464.8760 1469.1709 1480.8686 1504.6046 1623.2561 1644.0605 2977.7234 2984.8258 2991.6579 2992.2827 2995.3254 3005.5685 3011.0693 3032.6328 3047.5730 3053.3047 3055.4630 3063.6151 3064.3224 3068.3104 3099.0300 3139.3388 3153.3202 3544.8063 3552.6823
redmass: 6.4520 5.5355 6.4534 6.3423 6.1741 1.0614 4.6357 3.2578 3.3180 4.6136 5.8530 2.5619 3.1598 4.8473 2.2464 2.4064 2.8586 2.0929 1.8476 2.8766 2.1489 2.5483 3.0160 3.4323 2.9074 1.3761 3.2064 4.1485 4.8745 3.0629 3.8716 8.2012 1.4918 2.7622 2.6106 3.2728 2.4755 2.2588 1.9678 2.4701 2.2573 2.5019 2.3182 2.2014 1.9707 1.8946 1.6504 2.1985 1.1659 1.6425 2.3600 1.9251 1.6790 1.7958 1.5436 3.2323 1.3752 1.4033 1.4292 1.3420 1.3402 1.2305 1.2747 1.5467 1.5266 1.4069 1.5143 1.3727 1.3907 1.3154 1.2512 1.1673 1.1042 1.3258 1.0592 1.1374 1.0792 1.0878 1.0894 1.1704 2.1535 5.1159 9.6954 1.0656 1.0661 1.0622 1.0637 1.0593 1.0383 1.0808 1.0857 1.0975 1.0928 1.1015 1.0976 1.0664 1.1006 1.0942 1.1023 1.1118 1.0774 1.0768
irintensity: 1.1342 0.7937 0.9786 1.3022 12.6249 0.9548 2.3094 3.4795 7.6360 15.3078 0.5655 0.3532 2.0967 9.1539 2.4250 11.8197 1.9092 8.4479 24.2099 2.6014 0.9505 1.9991 9.5425 10.3622 2.1272 211.3320 2.8108 32.6630 3.5167 13.2448 5.4412 12.8186 1.0836 8.3358 16.4485 7.1179 8.8374 12.5153 10.3343 31.5249 40.9650 11.3507 4.5119 130.0718 45.6590 0.9366 10.4763 6.5833 2.7539 3.5130 9.1689 7.1070 0.5225 5.4027 29.0227 390.7202 47.6631 166.9261 3.5160 3.2116 21.3524 18.7558 24.3540 18.3154 24.3870 1.1637 0.3917 3.3544 7.1834 3.7043 50.1291 41.6470 16.3878 68.4034 19.9666 17.6758 17.7604 9.5394 18.1268 40.6478 626.2214 160.9220 185.3469 21.5890 18.4754 30.0349 12.5965 47.3539 2.3939 22.0957 22.3956 40.3715 7.1844 38.5812 17.3004 23.0413 44.2508 9.9716 9.7393 16.3470 19.3356 15.9205
temp: 298.150 k
press: 1.00000 atm
elementType: 17 8 8 8 7 7 6 6 6 6 6 6 6 6 6 6 6 1 1 1 1 1 1 1 1 1 1 1 1 1 1 1 1 1 1 1
symmnumber: 1
zpe: 781817.9 jmol-1
zpe.correction: 0.297779 hartree
zpe.thermalcorrener: 0.316661 hartree
zpe.thermalcorrenthalpy: 0.317605 hartree
zpe.thermalcorrgfe: 0.246909 hartree
zpe.sumelectzpe: -1224.502460 hartree
zpe.sumelectthermal: -1224.483578 hartree
zpe.sumelectthermalent: -1224.482634 hartree
zpe.sumelectthermalfe: -1224.553330 hartree
dipole: 0.0893 2.4683 1.2231
dipole: 2.7562
quadrupole: -120.2335 -112.9064 -106.7781
quadrupole: -10.9553 -8.6120 -6.5975
quadrupole: -6.9275 0.3995 6.5279 -10.9553 -8.6120 -6.5975
hfenergy: -1224.8002389 hartree
pointgroup: C01 [X(C11H19Cl1N2O3)]
dipole: 0.0289265 -0.9768264 0.4699141 debye
polarizability: 184.4086985|2.564431|144.9068347|-1.1008317|-6.8961673|121.2014918 unknown
InChI: InChI=1S/C11H19ClN2O3/c1-8(15)17-10-4-2-9(3-5-10)14-11(16)13-7-6-12/h9-10,13-14H,2-7H2,1H3
charge 0 multiplicity 1
36 atoms
Cl -5.814934 -2.174597 0.620042
O  3.32298 -0.998865 0.062121
O  -2.69787 1.719253 -0.759262
O  4.948183 0.349021 -0.938407
N  -1.229862 0.316718 0.399071
N  -3.243056 -0.542777 -0.473102
C  -0.248865 1.395434 0.650325
C  0.632643 1.684704 -0.596429
C  0.635051 1.029939 1.867825
C  2.472701 0.21069 0.327216
C  1.605642 0.521899 -0.905327
C  1.628158 -0.123516 1.564506
C  -2.404074 0.567074 -0.302559
C  4.537504 -0.785177 -0.600572
C  -4.525245 -0.407471 -1.160898
C  5.242136 -2.100618 -0.855341
C  -5.729549 -0.46639 -0.21955
H  -0.835662 2.30474 0.874669
H  1.207532 2.614326 -0.408883
H  -0.024749 1.882383 -1.46102
H  -0.001792 0.76757 2.733482
H  1.209666 1.932451 2.15321
H  3.152265 1.062116 0.528105
H  1.034049 -0.385486 -1.182678
H  2.253478 0.783299 -1.760878
H  2.286851 -0.297061 2.434845
H  1.093097 -1.077945 1.3823
H  -0.988208 -0.635118 0.676991
H  -3.062849 -1.420453 0.017515
H  -4.514651 0.586818 -1.647882
H  -4.627871 -1.179221 -1.946752
H  4.86553 -2.540732 -1.797066
H  5.044478 -2.81834 -0.044046
H  6.323356 -1.927098 -0.963795
H  -6.684749 -0.365758 -0.756434
H  -5.653309 0.25649 0.605059
