program: Gaussian 09
title: 000271759
version: EM64L-G09RevD.01
frameworkgroup: C1[X(C10H10O4)]
method: RPBEPBE
basis: SDD
operation: Freq
keyword: #pfreq=noraman
keyword: PBEPBE/SDD
title: #p freq=noraman PBEPBE/SDD
converged: NO YES NO NO
title: Mulliken charges:
elementType: O O O O C C C C C C C C C C H H H H H H H H H H
charge: -0.294402 -0.421869 -0.246031 -0.205788 0.242135 -0.461966 0.244118 -0.308551 0.189486 -0.363989 0.184506 -0.220247 -0.674476 -0.200662 0.311984 0.277357 0.228414 0.231721 0.231751 0.215172 0.228838 0.228827 0.214073 0.369601
chargesum: 0.00000
title: Mulliken charges with hydrogens summed into heavy atoms:
elementType: O O O O C C C C C C C C C C
charge: -0.294402 -0.052268 -0.246031 -0.205788 0.242135 -0.149982 0.244118 -0.031195 0.189486 -0.135575 0.184506 0.243225 -0.001639 0.013411
polarizability: 1.86907434e+02 -7.99614608e-02 1.39783967e+02 7.29072122e-04 4.82578089e-03 5.77791653e+01
1716.lowfreq: -28.9039 -0.0005 -0.0003 0.0005 3.2344 7.0779 13.6585 60.5560 80.6835
frequency: -22.7165 60.2916 80.6829 85.9582 125.5855 149.9928 160.9534 192.2265 248.5017 249.1936 297.0699 322.4912 329.5738 362.1164 401.6092 456.0996 477.5805 517.2349 536.4984 593.7555 631.3157 701.2636 752.8027 772.4317 795.8268 796.3169 823.8870 828.3114 928.3803 966.3586 976.8425 1012.0699 1024.7883 1066.7969 1091.8958 1111.5422 1136.1892 1158.6740 1173.2675 1232.9489 1248.5547 1252.2380 1283.5891 1357.6210 1380.2849 1396.7853 1407.4931 1428.3091 1463.4203 1473.2692 1484.6237 1487.4420 1588.4596 1590.5315 1626.6638 1628.4212 2954.5202 2994.6205 3009.7471 3067.6082 3092.0699 3105.8054 3120.8945 3156.5712 3181.0192 3581.2322
redmass: 2.6339 4.5190 4.9963 4.4650 4.0813 3.5325 7.2784 2.5229 5.3850 1.2787 5.7731 4.8800 7.4392 4.1431 1.1387 2.9607 6.6144 5.1068 3.8307 5.9658 7.4682 4.5978 4.2324 7.8183 1.1018 5.6041 3.8719 1.5288 4.4504 1.4870 1.3883 1.6632 2.3693 2.7678 2.4966 2.2273 1.4722 1.4957 1.6710 2.1999 1.1311 3.5331 1.5095 1.4030 1.5438 1.2696 5.2261 3.8566 1.0409 1.0587 1.7500 1.4061 7.0676 7.0070 10.3601 6.7428 1.0871 1.0355 1.0581 1.1065 1.0986 1.1028 1.0906 1.0920 1.0945 1.0662
irintensity: 0.2475 1.0039 0.8721 2.1264 0.0000 10.4588 0.8890 8.4095 6.0995 0.0102 3.1685 8.1319 14.4682 3.1772 146.8359 0.2585 4.9571 47.5184 5.7818 18.3411 8.7381 23.0673 13.6432 12.0814 1.8114 12.0138 14.1486 37.4112 7.6664 2.9228 0.5749 11.8823 65.3683 52.4936 443.0937 4.9947 5.7760 78.2105 200.7259 319.1916 0.0113 90.2483 0.4394 5.1222 2.4137 22.3910 16.8110 22.4499 12.4911 6.5108 58.0335 5.8720 146.0295 98.0040 148.6355 197.7947 64.2362 21.4172 19.2721 6.8590 30.6405 45.9918 14.9971 3.9907 1.8960 62.8252
temp: 298.150 k
press: 1.00000 atm
elementType: 8 8 8 8 6 6 6 6 6 6 6 6 6 6 1 1 1 1 1 1 1 1 1 1
symmnumber: 1
zpe: 472471.8 jmol-1
zpe.correction: 0.179955 hartree
zpe.thermalcorrener: 0.192770 hartree
zpe.thermalcorrenthalpy: 0.193715 hartree
zpe.thermalcorrgfe: 0.140394 hartree
zpe.sumelectzpe: -686.932040 hartree
zpe.sumelectthermal: -686.919225 hartree
zpe.sumelectthermalent: -686.918281 hartree
zpe.sumelectthermalfe: -686.971601 hartree
dipole: 2.1344 -7.0328 0.0001
dipole: 7.3496
quadrupole: -71.8328 -82.5158 -81.9463
quadrupole: 14.1370 0.0051 0.0043
quadrupole: 6.9322 -3.7508 -3.1813 14.1370 0.0051 0.0043
hfenergy: -687.1119951 hartree
pointgroup: C01 [X(C10H10O4)]
dipole: -0.8531279 -2.7628309 -0.0000572 debye
dipolederiv: -1.8856671 -0.2245673 -0.0005972 -0.4824197 -0.5584752 -0.0001667 -0.0012274 -0.000261 -0.2815164 -1.2031474 0.7429419 0.0000049 0.6079127 -0.4505412 -0.0000945 0.0000964 -0.0001686 -0.4057959 -0.7850139 0.190549 -0.0000199 0.0902605 -0.9427279 -0.0004708 -0.0001403 0.0002049 -0.3179513 -0.535918 -0.1251367 0.0000333 -0.5318646 -0.9725912 0.0002414 0.0000021 -0.0000756 -0.3313191 -0.7421127 0.0741118 -0.0000559 0.0894286 -0.4112905 0.0000402 0.0001462 0.0000065 -0.0451989 0.4583695 0.1160441 -0.0001135 0.0032987 0.0039838 -0.0000014 0.0001144 -0.0000532 -0.0497322 -0.857423 -0.3761034 0.0001257 0.080785 -0.4414775 0.0000289 0.0001495 0.0001851 -0.0209327 0.1879128 -0.1551688 -0.00003 -0.1950039 0.2777544 -0.0000296 0.0000639 -0.0000279 -0.0704508 1.1761051 -0.6995676 -0.0000924 -0.3035637 0.5727404 -0.0000275 -0.000107 0.0001127 0.0887281 -0.6561761 0.249063 0.0000296 -0.1282989 0.1143438 -0.0000243 0.0000912 -0.0001006 -0.1944871 2.2472674 -0.1589573 0.0004062 0.1976647 1.2193386 0.0006711 0.0004977 0.0001155 0.2345753 1.0895138 0.0408253 0.0002999 -0.0914631 0.240571 -0.0000507 0.0005019 0.0000726 0.3537368 -0.1108779 -0.087065 -0.0001451 -0.0597475 -0.0156107 -0.0001568 -0.0001621 -0.0001596 0.0643464 1.2007113 0.4948331 -0.0001361 0.6011509 1.0889671 -0.0002684 -0.0001767 -0.0001625 0.1207315 0.1600252 0.0050793 0.0000045 0.0211785 0.0678142 0.000014 -0.0000098 0.0000075 0.1486451 0.0643927 -0.0733379 0.0000527 -0.0852836 0.0780152 0.0000118 0.0000699 0.0000151 0.1481216 0.0452148 0.0659272 0.0000042 0.0462964 -0.1130284 0.0000395 -0.0000145 0.0000323 0.1721727 -0.0719525 -0.0269353 -0.0165448 0.0601225 0.0015934 -0.0910717 0.0257877 -0.096321 -0.0576228 -0.0718241 -0.0271209 0.0165865 0.060011 0.0013764 0.0911627 -0.0257026 0.0962853 -0.0572966 -0.1670208 0.0562408 -0.000143 0.0770704 0.0543115 0.0000233 -0.0001582 0.0000059 0.1166311 0.1212933 0.0283818 0.0436135 -0.0333089 0.0045551 -0.1013231 0.0155296 -0.1121269 -0.0647539 0.1213632 0.0282735 -0.0433267 -0.033458 0.0042457 0.1013937 -0.0152791 0.1122817 -0.0645428 -0.1464224 0.0443423 0.0000011 0.1442039 0.0080295 0.0000014 -0.0000963 0.0000544 0.1219864 0.3613869 -0.182653 0.0000425 -0.134972 0.1681026 0.0000576 0.0000238 0.0000775 0.3919254 unknown
polarizability: 186.9071047|-0.1480764|139.7842971|0.0007057|-0.0048293|57.7791653 unknown
InChI: InChI=1S/C10H10O4/c1-2-14-10(13)7-3-4-9(12)8(5-7)6-11/h3-6,12H,2H2,1H3
charge 0 multiplicity 1
24 atoms
O  -2.744193 -0.227381 -0.000437
O  3.471312 -1.783833 -0.000345
O  -1.85693 1.931196 0.000028
O  3.286761 2.308666 -0.000499
C  -0.359672 0.002666 0.000213
C  0.811235 0.792222 -0.000157
C  2.095706 0.198444 -0.000358
C  -0.244245 -1.414992 0.000365
C  2.19039 -1.225111 -0.000158
C  1.020946 -2.026015 0.000203
C  -1.683484 0.687889 0.000461
C  -4.113676 0.370705 -0.001061
C  -5.103418 -0.790169 -0.00265
C  3.317247 1.047517 -0.000784
H  0.737632 1.88544 -0.000283
H  -1.153296 -2.022154 0.000632
H  1.102879 -3.120623 0.000354
H  -4.212707 1.012154 0.893335
H  -4.211355 1.013438 -0.894683
H  -6.13672 -0.398011 -0.003171
H  -4.971497 -1.420406 -0.898849
H  -4.972898 -1.421702 0.892844
H  4.283308 0.495077 -0.000421
H  3.434576 -2.772512 -0.000178
