program: Gaussian 09
title: 000271758
version: EM64L-G09RevD.01
frameworkgroup: C1[X(C11H14O2)]
method: RPBEPBE
basis: SDD
operation: Freq
keyword: #pfreq=noraman
keyword: PBEPBE/SDD
title: #p freq=noraman PBEPBE/SDD
converged: YES YES NO NO
title: Mulliken charges:
elementType: O O C C C C C C C C C C C H H H H H H H H H H H H H H
charge: -0.323305 -0.397815 -0.036923 -0.518994 -0.711476 -0.712097 0.219760 0.132289 0.146983 -0.328757 -0.351020 -0.275169 -0.187608 0.231190 0.241142 0.227964 0.194608 0.213664 0.250611 0.202362 0.221943 0.211300 0.242928 0.258421 0.231820 0.233959 0.382221
chargesum: 0.00000
title: Mulliken charges with hydrogens summed into heavy atoms:
elementType: O O C C C C C C C C C C C
charge: -0.323305 -0.015594 0.194267 -0.049888 -0.052594 -0.076491 0.219760 0.132289 0.146983 -0.085829 -0.092599 -0.043350 0.046351
polarizability: 1.76113815e+02 6.89256793e+00 1.32224993e+02 -5.70842334e+00 -2.68183166e+00 7.25926568e+01
1716.lowfreq: -8.0710 -5.3113 -0.0006 0.0004 0.0009 5.9124 36.5206 53.6935 104.2774
frequency: 36.4987 53.6576 104.2681 122.4732 154.0259 211.6472 226.2399 237.9884 244.6021 286.5560 374.9649 381.4050 416.8644 430.2780 446.6793 483.4175 509.5528 549.9179 581.0352 650.7823 742.3365 757.6135 759.7237 820.2937 833.5733 860.6004 889.8372 917.2875 945.5056 952.1202 960.1155 961.9547 987.6981 1008.1112 1027.4422 1103.8126 1120.9361 1133.6091 1172.3010 1183.3791 1220.3587 1227.3478 1249.3355 1269.9668 1304.7781 1323.2437 1338.0288 1375.5766 1376.9872 1394.4371 1404.4771 1419.8298 1433.1693 1467.5166 1471.9724 1477.5048 1481.9317 1491.9498 1549.8154 1581.0405 1635.3686 2755.0310 2957.3506 2966.0013 2973.2795 2999.6934 3016.9682 3057.5856 3067.0571 3072.8041 3090.1701 3135.4831 3145.6967 3165.8769 3178.0710
redmass: 3.2071 3.1711 3.4129 3.2243 7.0375 1.0515 2.9514 3.6068 1.3895 2.5587 2.7799 2.4995 3.3458 3.9520 4.2618 4.0733 3.0875 7.0638 2.9537 6.3109 3.1804 5.4497 1.3183 3.8718 3.3330 1.4778 1.7779 1.1882 2.0169 1.3303 1.0995 1.6133 1.3333 2.6256 2.1704 1.6611 1.7773 2.0853 1.1077 1.8448 1.5551 1.3660 1.8788 2.2105 1.9885 1.7706 1.5017 1.5069 1.5510 1.3985 3.8014 1.6021 1.5424 1.0732 1.0697 2.1494 1.0575 1.0478 4.2838 3.6055 4.8549 1.0709 1.0604 1.0361 1.0381 1.0868 1.0934 1.0989 1.0987 1.0986 1.0990 1.0857 1.0900 1.0959 1.0987
irintensity: 0.0457 0.1308 0.4157 1.3281 0.0072 0.0516 3.3682 0.0909 0.2429 2.1710 5.4186 1.3467 2.3204 4.3733 2.8497 10.0513 7.8416 1.5410 0.3968 22.4436 6.4318 6.1409 95.7185 3.2436 6.5412 6.5392 9.5113 7.7998 22.0603 17.1349 106.4466 4.8291 0.5500 10.8444 9.9054 5.3468 9.2577 7.2311 12.4090 22.5929 52.3323 11.0919 44.2954 108.8187 78.2835 38.8863 25.5363 94.9290 71.4642 6.5288 28.8646 8.4697 61.6564 12.8429 15.9470 87.2491 4.7376 24.0316 22.2937 88.1274 148.9816 328.0358 28.1864 35.2829 28.3867 0.3361 11.5424 23.0591 48.9962 70.5506 32.3633 1.3666 12.3288 18.6843 11.1628
temp: 298.150 k
press: 1.00000 atm
elementType: 8 8 6 6 6 6 6 6 6 6 6 6 6 1 1 1 1 1 1 1 1 1 1 1 1 1 1
symmnumber: 1
zpe: 584476.3 jmol-1
zpe.correction: 0.222615 hartree
zpe.thermalcorrener: 0.235293 hartree
zpe.thermalcorrenthalpy: 0.236237 hartree
zpe.thermalcorrgfe: 0.183251 hartree
zpe.sumelectzpe: -577.058492 hartree
zpe.sumelectthermal: -577.045815 hartree
zpe.sumelectthermalent: -577.044871 hartree
zpe.sumelectthermalfe: -577.097856 hartree
dipole: 0.3181 -3.6542 0.1888
dipole: 3.6728
quadrupole: -70.7993 -80.1359 -80.6914
quadrupole: 3.2190 -1.1718 0.3451
quadrupole: 6.4095 -2.9270 -3.4825 3.2190 -1.1718 0.3451
hfenergy: -577.2811078 hartree
pointgroup: C01 [X(C11H14O2)]
dipole: -0.0875404 1.4338417 0.1564901 debye
polarizability: 176.7293339|5.9924668|131.5190072|0.3059226|5.4055646|72.683123 unknown
InChI: InChI=1S/C11H14O2/c1-8(2)7-11(13)9-5-3-4-6-10(9)12/h3-6,8,12H,7H2,1-2H3
charge 0 multiplicity 1
27 atoms
O  -0.88531 -1.608281 -0.309706
O  1.550105 -2.256382 -0.332713
C  -3.15885 0.044052 0.076383
C  -1.741965 0.657941 -0.032926
C  -3.377011 -0.623474 1.454915
C  -4.226189 1.131554 -0.187182
C  -0.608505 -0.357844 -0.125938
C  0.798726 0.069043 -0.040389
C  1.840701 -0.926494 -0.151418
C  1.181203 1.433283 0.139242
C  3.205148 -0.541417 -0.075479
C  2.530477 1.806832 0.209245
C  3.541777 0.809523 0.102295
H  -3.246387 -0.741657 -0.698761
H  -1.680918 1.302656 -0.936053
H  -1.561586 1.33221 0.828908
H  -3.296028 0.121587 2.270772
H  -4.383362 -1.077219 1.512919
H  -2.636501 -1.421914 1.632167
H  -4.154179 1.947691 0.558084
H  -5.243648 0.705349 -0.117836
H  -4.113982 1.578119 -1.193399
H  0.4060 2.2020 0.221434
H  3.967827 -1.32052 -0.161027
H  2.806717 2.856835 0.346472
H  4.597424 1.09788 0.158872
H  0.516113 -2.332854 -0.370283
