program: Gaussian 09
title: 000271776
version: EM64L-G09RevD.01
frameworkgroup: C1[X(C17H28O)]
method: RPBEPBE
basis: SDD
operation: Freq
keyword: #pfreq=noraman
keyword: PBEPBE/SDD
title: #p freq=noraman PBEPBE/SDD
converged: YES YES NO NO
title: Mulliken charges:
elementType: O C C C C C C C C C C C C C C C C C H H H H H H H H H H H H H H H H H H H H H H H H H H H H
charge: -0.444836 0.190497 -0.074561 0.342268 -0.458637 0.203136 -0.557447 -0.527317 -0.427906 0.182750 -0.537658 -0.774790 -0.446061 -0.540009 -0.777161 -0.508388 -0.426864 -0.411886 0.173059 0.211646 0.188670 0.212033 0.214859 0.199313 0.214029 0.193997 0.207739 0.217588 0.216956 0.231647 0.209589 0.212671 0.212968 0.229007 0.210125 0.216950 0.204647 0.243403 0.209218 0.208629 0.213768 0.203141 0.200189 0.204736 0.199749 0.334546
chargesum: 0.00000
title: Mulliken charges with hydrogens summed into heavy atoms:
elementType: O C C C C C C C C C C C C C C C C C
charge: -0.110291 0.190497 0.098498 0.342268 -0.058320 0.203136 -0.130555 -0.113975 -0.026170 0.182750 -0.103114 -0.120883 -0.004086 -0.112935 -0.119894 -0.085992 -0.023533 -0.007401
polarizability: 1.86502357e+02 -3.86444591e+00 1.75559597e+02 -2.25215051e+00 -7.85597403e+00 1.61633441e+02
1716.lowfreq: -16.7214 -13.0573 -9.1495 0.0005 0.0006 0.0009 48.6527 57.6234 93.1529
frequency: 48.5793 57.5508 93.0788 104.3650 128.7912 187.6829 196.6397 200.2357 211.6781 227.7417 242.6465 272.8108 279.1154 292.1500 303.2213 307.9252 328.5709 347.2287 347.9486 371.9092 401.4028 422.6536 435.9362 458.1251 470.3548 488.3538 528.2820 537.8595 579.2079 601.4300 611.9435 680.3092 729.7403 790.8234 802.9887 805.3785 831.6769 846.1254 870.1105 878.4115 896.3867 901.5778 921.3490 930.8979 941.1023 955.5267 965.4951 972.8122 984.5657 1008.6543 1024.7440 1026.5370 1048.0209 1070.4960 1073.7459 1079.6784 1093.4032 1097.2617 1105.0270 1122.4162 1133.1104 1139.1203 1161.2486 1168.1843 1176.0016 1185.1106 1199.5098 1215.0758 1219.6597 1237.9839 1247.8481 1260.7834 1266.6966 1290.1330 1308.4279 1322.9831 1327.9713 1330.2809 1336.1047 1337.4095 1339.9235 1342.6771 1346.6996 1351.2167 1357.0026 1361.6328 1366.9493 1381.4882 1387.0756 1448.2890 1453.1095 1456.7806 1461.3847 1464.2039 1466.8315 1468.8520 1470.7409 1474.5034 1476.1225 1483.1013 1485.2923 1486.6112 1501.4072 1683.7157 2927.5898 2935.2277 2938.1260 2946.6834 2962.1520 2965.0506 2966.5383 2967.9230 2970.1809 2972.1246 2974.9781 2976.3393 2988.2390 2993.8488 3000.6693 3007.5808 3017.4342 3026.0981 3033.7563 3039.4194 3042.5386 3047.5329 3053.3282 3068.5111 3078.5112 3082.6998 3091.2307 3571.6752
redmass: 3.9872 3.4636 2.7649 2.4876 2.4713 3.5778 1.1243 1.6144 1.8398 1.9033 2.0847 2.3675 2.1237 2.4025 1.8803 1.8322 2.5591 2.1951 2.1149 2.3646 2.7257 2.1306 2.8291 2.9998 3.4674 3.0214 2.6375 2.1705 2.5640 2.8686 3.2710 2.4584 3.4106 1.7728 2.5363 2.0123 1.6301 1.5534 2.5795 2.1646 1.5281 1.9420 1.9679 1.9360 1.9544 1.7265 4.4479 1.9174 1.8652 2.2191 2.0043 1.7509 2.0792 1.9302 1.5133 1.9006 1.7286 1.8456 1.8007 1.3083 1.9193 2.3010 1.4927 1.5807 1.7824 1.7290 2.1927 1.7592 1.5886 1.7442 1.3404 1.5449 1.2443 1.4028 1.4282 1.3904 1.2949 1.4091 1.5415 1.5324 1.4421 1.4038 1.4630 1.5534 1.3871 1.8249 1.2004 1.2132 1.2162 1.0898 1.0806 1.0853 1.0627 1.0846 1.0843 1.0643 1.0747 1.0851 1.0725 1.0677 1.0679 1.0791 1.0715 7.2127 1.0826 1.0615 1.0636 1.0609 1.0599 1.0501 1.0599 1.0564 1.0748 1.0668 1.0396 1.0905 1.0846 1.0891 1.0629 1.0627 1.0971 1.0994 1.0986 1.0949 1.1039 1.1005 1.0983 1.0982 1.0986 1.0981 1.1003 1.0662
irintensity: 0.2241 0.6817 0.5139 1.9644 1.0395 2.7211 1.1929 0.9288 1.0257 1.3263 4.1796 11.7477 52.3349 12.3134 1.0734 26.6294 12.7259 0.6522 13.0442 9.4084 0.4167 2.8435 0.2270 2.1278 0.4894 0.4977 2.0323 0.3631 1.0574 0.9613 0.7578 1.7250 5.6483 0.7340 2.0732 3.8916 4.2129 18.4834 5.3220 1.7934 3.7866 8.9467 3.6097 0.9427 1.4963 1.9547 98.9089 2.6093 14.9315 2.6356 2.0280 3.0451 0.7257 5.3137 1.0878 0.4624 5.9636 12.4285 0.3003 2.3895 0.3942 0.9332 2.9117 2.1207 0.5567 1.4113 4.8171 2.7155 4.4665 7.5754 2.4554 0.9646 0.3765 3.2834 5.2212 4.7246 9.6817 2.5913 0.6046 1.4742 2.2252 1.9435 1.9032 1.1711 0.9705 1.0326 12.7872 18.3419 13.8718 1.3689 1.6390 11.4498 1.7814 4.2587 9.6368 9.6591 16.1911 7.4760 9.9675 2.6503 8.8714 20.6406 20.7600 0.0824 26.4184 24.6264 38.6394 84.5496 10.7436 13.9047 30.2116 65.5018 10.9795 27.9596 55.1581 7.4296 70.5551 32.1914 18.0191 76.2408 52.1548 82.7320 68.2737 30.5581 65.5290 47.4800 54.5000 35.9236 21.8477 35.1869 29.3327 5.7789
temp: 298.150 k
press: 1.00000 atm
elementType: 8 6 6 6 6 6 6 6 6 6 6 6 6 6 6 6 6 6 1 1 1 1 1 1 1 1 1 1 1 1 1 1 1 1 1 1 1 1 1 1 1 1 1 1 1 1
symmnumber: 1
zpe: 1086005.4 jmol-1
zpe.correction: 0.413638 hartree
zpe.thermalcorrener: 0.431548 hartree
zpe.thermalcorrenthalpy: 0.432492 hartree
zpe.thermalcorrgfe: 0.370158 hartree
zpe.sumelectzpe: -738.381859 hartree
zpe.sumelectthermal: -738.363949 hartree
zpe.sumelectthermalent: -738.363005 hartree
zpe.sumelectthermalfe: -738.425338 hartree
dipole: 1.3425 1.7925 0.2948
dipole: 2.2588
quadrupole: -115.5668 -116.4186 -109.5331
quadrupole: -6.7392 -1.6914 -4.6770
quadrupole: -1.7273 -2.5791 4.3064 -6.7392 -1.6914 -4.6770
hfenergy: -738.7954965 hartree
pointgroup: C01 [X(C17H28O1)]
dipole: 0.515048 -0.712124 -0.1317929 debye
polarizability: 186.6176787|3.6404672|175.8343471|2.3840501|-7.4813868|161.243369 unknown
InChI: InChI=1S/C17H28O/c1-16(12-18)10-5-11-17(2)14-7-4-3-6-13(14)8-9-15(16)17/h15,18H,3-12H2,1-2H3
charge 0 multiplicity 1
46 atoms
O  -2.405405 1.954411 1.91283
C  0.017135 -1.202087 -0.596864
C  -1.154333 -0.268085 -1.102156
C  -2.14316 0.313997 -0.005212
C  -0.528045 -2.204289 0.469661
C  1.238788 -0.392309 -0.091462
C  -0.583092 0.787919 -2.09024
C  -2.557534 -0.826282 0.970955
C  -1.348289 -1.546636 1.594933
C  1.502261 0.869283 -0.547886
C  0.609377 1.606184 -1.534185
C  0.517467 -2.077056 -1.796215
C  -1.535467 1.501577 0.807713
C  2.21264 -1.111975 0.844751
C  -3.435359 0.828008 -0.697818
C  2.714317 1.681074 -0.097546
C  3.598759 -0.43673 0.938174
C  3.440565 1.085142 1.125581
H  -1.812255 -0.935857 -1.703763
H  0.301568 -2.803713 0.886622
H  -1.19149 -2.923395 -0.055949
H  -1.3806 1.477195 -2.424162
H  -0.252507 0.254699 -3.000775
H  -3.15103 -1.574938 0.406879
H  -3.241934 -0.422135 1.7425
H  -1.69089 -2.319771 2.310255
H  -0.715899 -0.840577 2.171641
H  0.25257 2.537043 -1.04612
H  1.235964 1.958399 -2.381984
H  0.977044 -1.464957 -2.590351
H  1.279888 -2.803134 -1.456292
H  -0.320873 -2.652625 -2.234835
H  -1.460234 2.391981 0.164004
H  -0.527121 1.25244 1.187889
H  1.771814 -1.183672 1.862717
H  2.344878 -2.159852 0.506999
H  -3.962736 0.004648 -1.216416
H  -4.116361 1.259743 0.057611
H  -3.222962 1.617904 -1.440542
H  3.425764 1.768481 -0.948107
H  2.388297 2.719851 0.120997
H  4.17867 -0.88092 1.769948
H  4.166993 -0.628056 0.005413
H  4.424369 1.57296 1.263434
H  2.849103 1.279365 2.043056
H  -2.356553 1.292249 2.646615
