program: Gaussian 09
title: 000271788
version: EM64L-G09RevD.01
frameworkgroup: C1[X(C16H13IN2O2)]
method: RPBEPBE
basis: SDD
operation: Freq
keyword: #p
keyword: freq=noraman
keyword: PBEPBE/SDD
title: #p freq=noraman PBEPBE/SDD
converged: YES YES NO NO
title: Mulliken charges:
elementType: I O O N N C C C C C C C C C C C C C C C C H H H H H H H H H H H H H
charge: 0.106591 -0.205138 -0.230097 -0.408527 -0.331126 -0.188650 -0.570904 0.140438 0.209922 0.493809 0.477767 -0.347680 -0.395246 -0.351029 -0.347768 -0.336976 -0.212860 -0.183735 -0.222322 -0.222844 -0.242812 0.281171 0.232469 0.255688 0.351365 0.267638 0.244955 0.275173 0.277804 0.237726 0.254930 0.229413 0.229915 0.230942
chargesum: 0.00000
title: Mulliken charges with hydrogens summed into heavy atoms:
elementType: I O O N N C C C C C C C C C C C C C C C C
charge: 0.106591 -0.205138 -0.230097 -0.057162 -0.331126 0.092520 -0.082747 0.140438 0.209922 0.493809 0.477767 -0.080043 -0.150290 -0.075856 -0.069964 -0.336976 0.024866 0.071195 0.007091 0.007070 -0.011870
polarizability: 3.04904040e+02 3.89865219e+00 2.33112204e+02 -2.32933822e+01 8.45817524e+00 1.01862288e+02
1716.lowfreq: -6.7268 -5.1822 -1.6980 -0.0005 -0.0004 -0.0002 11.2849 16.3940 31.7251
frequency: 11.0427 16.3456 31.6715 39.1565 75.8039 84.6519 117.7357 135.6176 148.4485 178.0844 194.8511 217.2128 252.8164 279.3396 296.9929 358.3732 365.8945 402.6512 410.3587 436.4251 445.0869 496.5078 501.9365 521.6789 565.2123 594.3173 612.2554 625.1661 641.7804 653.1885 683.5694 691.4703 695.2472 709.7772 751.8323 768.6816 792.0465 836.6530 843.4454 874.0010 906.5324 914.5777 917.4287 954.1115 970.1304 980.8199 984.7922 989.8223 992.7368 1008.5584 1027.5868 1035.7471 1061.8419 1087.3339 1096.6097 1100.9985 1148.8722 1175.1096 1175.8115 1183.8902 1197.0447 1210.7109 1213.8221 1246.5522 1296.9089 1311.1987 1324.9908 1332.4844 1350.3963 1368.7996 1375.6923 1382.9990 1412.8467 1444.8712 1459.3545 1469.3231 1488.8723 1567.0085 1593.3291 1598.0174 1611.6916 1646.4465 1716.8734 2989.7174 3009.6802 3074.3848 3126.6819 3131.8946 3144.5891 3146.6727 3150.8531 3162.8382 3174.1138 3190.3447 3193.3080 3600.8165
redmass: 8.9695 6.7990 6.0170 4.3428 6.0752 7.7641 7.6607 5.7479 5.1748 5.9544 5.0184 4.9734 8.2368 5.8514 9.2701 3.9254 4.5035 2.8385 3.0449 3.0430 6.6989 1.8084 1.7422 3.8692 5.5065 10.2888 6.4077 3.8818 6.2746 6.4803 5.9844 1.9825 2.5484 6.3083 5.1847 1.7910 1.5572 1.2644 4.0659 2.3428 1.5371 1.4407 1.4938 3.1903 1.4062 5.8654 1.3560 5.6104 1.3347 4.0798 3.5674 2.1395 2.3035 2.2895 1.6633 1.6024 4.0003 1.2697 1.0508 1.0894 1.1493 1.8797 2.4875 1.8624 1.3060 1.5311 1.4672 1.3494 5.3020 7.5687 1.7904 8.0728 2.4197 2.3334 2.3377 1.1164 2.3242 6.3199 6.3524 6.4439 5.9217 11.5537 10.2415 1.0828 1.0605 1.1037 1.0883 1.0855 1.0910 1.0924 1.0929 1.0976 1.0978 1.0942 1.0964 1.0800
irintensity: 0.1074 0.0296 0.6165 0.2293 2.0647 0.4608 1.7702 2.3875 1.5200 0.6742 5.8947 2.0728 1.9950 0.7184 14.1709 0.3806 3.9353 0.7044 0.7001 28.0030 5.2592 95.1655 34.0679 8.4945 6.1148 33.2376 1.3111 14.5468 8.9986 28.0822 7.7056 42.9741 30.4997 7.6646 46.8831 53.8565 44.8311 0.4470 15.2073 12.1460 11.0205 5.5291 1.9681 14.0265 0.1128 9.4159 0.3865 0.4485 0.6412 7.1872 10.4786 14.4628 17.5456 31.7610 15.9360 3.5151 86.7530 64.0405 0.9231 1.0420 8.7867 46.2917 27.8207 25.0955 3.6601 17.2619 43.6227 1.1073 401.2144 2.1019 6.5254 0.9098 24.1507 16.9628 37.3479 9.5526 111.5603 61.6139 5.2032 33.2252 23.5262 435.2399 249.9739 9.2426 10.1204 9.3674 6.5304 0.0377 19.5753 7.7633 8.8184 32.9100 8.9227 1.7457 2.2628 64.6152
temp: 298.150 k
press: 1.00000 atm
elementType: 53 8 8 7 7 6 6 6 6 6 6 6 6 6 6 6 6 6 6 6 6 1 1 1 1 1 1 1 1 1 1 1 1 1
symmnumber: 1
zpe: 668633.4 jmol-1
zpe.correction: 0.254669 hartree
zpe.thermalcorrener: 0.272871 hartree
zpe.thermalcorrenthalpy: 0.273815 hartree
zpe.thermalcorrgfe: 0.203384 hartree
zpe.sumelectzpe: -887.529668 hartree
zpe.sumelectthermal: -887.511466 hartree
zpe.sumelectthermalent: -887.510522 hartree
zpe.sumelectthermalfe: -887.580953 hartree
dipole: -1.4949 2.2516 0.3033
dipole: 2.7197
quadrupole: -130.3979 -132.9738 -141.9615
quadrupole: -7.3560 -5.3236 11.3607
quadrupole: 4.7132 2.1373 -6.8504 -7.3560 -5.3236 11.3607
hfenergy: -887.7843371 hartree
pointgroup: C01 [X(C16H13I1N2O2)]
dipole: 0.7676819 -0.7165104 0.2054245 debye
polarizability: 301.2013359|21.0717565|233.9583747|15.9449647|-23.6751315|104.7188221 unknown
InChI: InChI=1S/C16H13IN2O2/c17-12-6-4-5-11(9-12)10-14-15(20)19(16(21)18-14)13-7-2-1-3-8-13/h1-9,14,18H,10H2
charge 0 multiplicity 1
34 atoms
I  5.589384 2.821752 -0.852132
O  -1.305946 -2.298673 -0.358174
O  -1.347207 2.242135 1.013521
N  0.363856 0.624533 0.783526
N  -1.746837 -0.023836 0.255097
C  0.507482 -0.777276 0.391634
C  1.464213 -1.020242 -0.813492
C  -0.944547 -1.167583 0.04831
C  -0.937184 1.095805 0.724228
C  2.907222 -0.699989 -0.456965
C  -3.171159 0.051108 0.040894
C  3.453305 0.575787 -0.757918
C  3.715257 -1.650951 0.218106
C  -3.9709 -1.104237 0.23235
C  -3.766008 1.271786 -0.366891
C  4.779893 0.879716 -0.381682
C  5.040531 -1.334479 0.585385
C  5.587106 -0.062556 0.290819
C  -5.362637 -1.031095 0.012551
C  -5.160666 1.329846 -0.573105
C  -5.965703 0.182875 -0.388154
H  0.845616 -1.399875 1.243997
H  1.119604 -0.403585 -1.663125
H  1.350293 -2.081505 -1.101089
H  1.126696 1.218398 1.104259
H  2.846535 1.312967 -1.294275
H  3.309355 -2.644657 0.443152
H  -3.509819 -2.048072 0.530074
H  -3.151831 2.164997 -0.496618
H  5.661659 -2.075901 1.099345
H  6.614907 0.179098 0.575161
H  -5.974783 -1.927725 0.158362
H  -5.615887 2.27713 -0.88183
H  -7.047202 0.234303 -0.553921
