program: Gaussian 09
title: 000271755
version: EM64L-G09RevD.01
frameworkgroup: C1[X(C11H13BrO2)]
method: RPBEPBE
basis: SDD
operation: Freq
keyword: #p
keyword: freq=noraman
keyword: PBEPBE/SDD
title: #p freq=noraman PBEPBE/SDD
converged: YES YES NO NO
title: Mulliken charges:
elementType: Br O O C C C C C C C C C C C H H H H H H H H H H H H H
charge: -0.006786 -0.283177 -0.434590 -0.061868 -0.248856 -0.077554 0.267861 0.170246 -0.721906 -0.708543 -0.323149 -0.345926 -0.225742 -0.146886 0.244650 0.224166 0.221411 0.215042 0.231363 0.217181 0.202940 0.211624 0.253944 0.271688 0.256439 0.346230 0.250198
chargesum: 0.00000
title: Mulliken charges with hydrogens summed into heavy atoms:
elementType: Br O O C C C C C C C C C C C
charge: -0.006786 -0.283177 -0.088360 0.182782 -0.024690 0.143857 0.267861 0.170246 -0.058320 -0.040035 -0.051461 -0.089487 -0.225742 0.103312
polarizability: 2.12964044e+02 3.98201625e-01 1.32596584e+02 -3.27967884e+00 3.72071232e+00 7.68929781e+01
1716.lowfreq: -19.7685 -6.5091 0.0004 0.0006 0.0007 3.1327 23.7775 72.9706 96.1336
frequency: 20.9823 72.9650 96.1206 107.7699 130.9234 173.8280 199.7215 217.2704 233.2753 251.8384 270.7862 309.4167 310.3342 331.5929 348.9096 407.4506 427.8778 469.0053 522.0633 547.0471 600.8439 636.1591 650.0059 725.5211 790.7790 811.9011 841.9632 857.7202 888.4778 895.9465 922.3445 940.5636 943.3315 960.5256 985.6115 1031.4732 1048.9126 1099.0981 1125.1010 1139.9215 1148.2875 1180.2110 1186.4834 1220.8365 1237.6102 1251.0608 1279.1946 1290.8827 1307.1270 1341.3922 1354.1915 1376.9861 1378.4453 1397.5814 1420.3474 1456.1733 1466.9845 1471.0112 1481.3456 1492.2084 1598.0966 1612.6040 2948.2527 2966.0071 2976.2862 2980.1931 3004.1281 3054.5172 3070.0338 3076.7513 3101.2990 3160.5359 3172.9219 3181.5402 3547.0823
redmass: 4.9266 2.7213 5.3790 6.2505 4.8789 4.8768 1.0485 1.6157 2.8482 3.2703 1.1061 3.7252 4.6535 4.1934 3.7516 2.9684 2.7931 3.9228 3.5468 4.5622 6.4768 5.9942 6.1447 4.6787 4.8919 1.4334 2.5413 3.1608 2.5438 1.8583 1.1950 1.8899 1.5514 1.6005 5.7824 2.8988 2.0280 2.4249 2.2297 1.8782 1.3522 1.5336 1.5874 1.5641 1.4958 1.3880 1.4668 1.3882 1.4441 1.5892 1.6002 3.1251 1.4316 1.2252 3.7276 3.1231 1.0508 1.0497 1.0520 1.0567 8.4166 8.3477 1.0841 1.0365 1.0808 1.0395 1.0866 1.0992 1.0988 1.0979 1.0990 1.0890 1.0935 1.0972 1.0661
irintensity: 0.1964 0.1491 0.1260 1.6534 1.4665 1.8017 0.6830 1.8043 5.6500 3.6157 114.7605 7.8903 0.0558 0.8796 4.3242 3.5185 8.2378 5.0643 8.5736 7.3213 17.5893 29.2197 6.4436 6.9988 9.6754 48.7195 12.5707 7.9539 33.2143 19.8472 2.6786 50.5284 26.6944 22.5240 59.5149 12.8661 16.8793 79.4951 2.5939 3.5464 51.8572 76.7698 28.8573 7.7531 2.8318 44.1551 9.7783 5.4040 0.3007 11.3577 1.0226 1.9550 27.5652 30.7047 54.2970 158.0812 6.4772 2.6691 7.9111 23.1393 6.3962 14.6359 40.3531 29.9173 2.4275 32.9082 36.1276 48.2300 20.6673 62.0355 22.1885 2.2885 0.8457 4.1400 3.1991
temp: 298.150 k
press: 1.00000 atm
elementType: 35 8 8 6 6 6 6 6 6 6 6 6 6 6 1 1 1 1 1 1 1 1 1 1 1 1 1
symmnumber: 1
zpe: 559457.5 jmol-1
zpe.correction: 0.213086 hartree
zpe.thermalcorrener: 0.227196 hartree
zpe.thermalcorrenthalpy: 0.228140 hartree
zpe.thermalcorrgfe: 0.170907 hartree
zpe.sumelectzpe: -589.817091 hartree
zpe.sumelectthermal: -589.802981 hartree
zpe.sumelectthermalent: -589.802037 hartree
zpe.sumelectthermalfe: -589.859270 hartree
dipole: -4.1769 -0.7339 -1.3041
dipole: 4.4369
quadrupole: -85.7619 -86.9717 -96.1806
quadrupole: 9.1378 1.6829 2.5829
quadrupole: 3.8762 2.6663 -6.5425 9.1378 1.6829 2.5829
hfenergy: -590.0301767 hartree
pointgroup: C01 [X(C11H13Br1O2)]
dipole: 1.6351055 -0.134745 0.5961564 debye
polarizability: 212.5043594|6.2505656|132.664527|3.1541129|-5.8584086|77.2847199 unknown
InChI: InChI=1S/C11H13BrO2/c1-6(2)11-10(13)8-5-7(12)3-4-9(8)14-11/h3-6,10-11,13H,1-2H3
charge 0 multiplicity 1
27 atoms
Br -4.862839 -0.814861 0.07351
O  0.890909 1.294287 -0.283784
O  0.779113 -2.258468 -0.811303
C  1.705987 0.019329 -0.204161
C  0.697053 -1.134096 0.135418
C  2.848181 0.225563 0.805574
C  -0.649572 -0.45649 0.011283
C  -0.458984 0.923883 -0.214569
C  3.723318 -1.050321 0.886111
C  3.705384 1.456314 0.433305
C  -1.943381 -0.995358 0.103099
C  -1.538593 1.814785 -0.353683
C  -3.031178 -0.104452 -0.037009
C  -2.846086 1.27956 -0.258899
H  2.105752 -0.151215 -1.224208
H  0.865036 -1.508758 1.168287
H  2.387686 0.405573 1.799177
H  4.171364 -1.285668 -0.098871
H  4.552428 -0.897217 1.599718
H  3.154516 -1.934801 1.231798
H  4.209474 1.304004 -0.540631
H  4.486518 1.630537 1.195536
H  3.08067 2.361524 0.357129
H  -2.099183 -2.065955 0.258912
H  -1.376651 2.88075 -0.533063
H  1.602877 -2.777491 -0.622473
H  -3.7126 1.938942 -0.362802
