program: Gaussian 09
title: 000271841
version: EM64L-G09RevD.01
frameworkgroup: C1[X(C18H14Cl2N2O3)]
method: RPBEPBE
basis: SDD
operation: Freq
keyword: #p
keyword: freq=noraman
keyword: PBEPBE/SDD
title: #p freq=noraman PBEPBE/SDD
converged: YES YES NO NO
title: Mulliken charges:
elementType: Cl Cl O O O N N C C C C C C C C C C C C C C C C C C H H H H H H H H H H H H H H
charge: -0.052205 -0.046814 -0.197445 -0.226658 -0.158089 -0.298547 -0.322912 0.075395 0.099208 -0.727011 0.232705 0.186389 0.469199 0.483603 -0.774224 -0.332213 -0.316071 -0.329358 -0.333239 -0.212473 -0.246259 -0.119503 -0.206130 -0.204981 -0.117649 0.262018 0.245521 0.246550 0.244605 0.289291 0.259224 0.294562 0.241966 0.275339 0.281988 0.258192 0.256813 0.259660 0.259554
chargesum: 0.00000
title: Mulliken charges with hydrogens summed into heavy atoms:
elementType: Cl Cl O O O N N C C C C C C C C C C C C C C C C C C
charge: -0.052205 -0.046814 -0.197445 -0.226658 -0.158089 -0.298547 -0.322912 0.075395 0.099208 0.027078 0.232705 0.186389 0.469199 0.483603 0.018895 -0.037651 -0.074105 -0.054020 -0.051252 0.045719 0.010554 -0.119503 0.053530 0.054573 -0.117649
polarizability: 3.85092183e+02 -4.75144129e+00 2.41085282e+02 -1.90177325e+00 -3.18473327e+00 1.22335710e+02
1716.lowfreq: -6.7006 -2.8375 0.0012 0.0017 0.0017 3.8950 21.8315 24.9905 39.3669
frequency: 21.7019 24.9148 39.3550 46.7490 60.8238 63.1697 72.4799 105.6420 130.5478 150.9669 155.7648 182.9008 185.9988 192.7195 204.5324 219.3997 253.3707 264.3365 284.5153 291.5874 310.8824 331.4055 343.5866 375.5148 397.5645 407.0483 408.0847 410.7888 426.9227 453.7630 475.9711 503.3262 516.5834 543.7625 553.7345 587.1253 623.3768 626.8027 645.4161 678.9735 697.7259 699.8007 701.4107 718.4589 748.2953 772.0961 803.2782 813.7856 814.5931 828.1190 829.9858 890.8330 932.9843 944.5492 953.5510 957.3094 960.2977 983.8150 997.6697 1000.1243 1018.7454 1048.5222 1077.5999 1082.0766 1095.5792 1102.6587 1127.0059 1129.9949 1149.9612 1177.8850 1195.0104 1195.8807 1200.4575 1205.6936 1301.6474 1305.3777 1330.6397 1346.6248 1370.3056 1372.8339 1375.3145 1392.4887 1405.1445 1409.2737 1439.9968 1450.7070 1473.1964 1479.8258 1482.1819 1487.1455 1582.3426 1586.3651 1601.8377 1604.9886 1635.2735 1637.8331 1689.5124 2982.5734 3009.5152 3065.8588 3107.3144 3120.9163 3126.5400 3163.7472 3168.3937 3169.1579 3170.7228 3184.9536 3193.3301 3198.7949 3203.4508
redmass: 7.2367 5.4051 5.1581 7.3234 7.9238 3.8109 8.7013 10.1387 9.0089 7.2311 6.5329 8.1142 1.0598 5.1142 1.7727 2.9686 4.2027 4.3365 5.3884 4.8048 4.6774 3.8928 6.1256 5.8769 7.5880 5.1195 3.1770 3.1958 7.1207 9.8345 4.3848 3.0828 3.5366 4.2260 4.0814 5.5133 7.0673 7.1811 8.2371 7.1939 5.0354 3.8140 5.8741 6.2006 3.7139 4.9480 1.3391 2.3377 1.4941 1.6684 1.6249 3.9696 1.3535 1.3564 2.0845 1.3743 1.3538 3.7597 3.8503 3.7328 1.7142 5.0262 2.6133 2.6486 2.1497 2.9662 1.4338 1.6333 2.8083 3.4371 1.3329 3.3862 1.1667 3.9922 1.2784 1.3042 5.9501 6.4677 5.8478 1.3157 8.2177 1.2124 3.1691 3.1426 1.0613 1.0616 1.0657 1.5796 1.3455 2.5327 7.6953 7.7994 6.1157 6.1648 10.3799 10.0757 12.1628 1.0373 1.0355 1.0959 1.1001 1.1009 1.1003 1.0885 1.0913 1.0903 1.0906 1.0957 1.0959 1.0961 1.0946
irintensity: 0.1232 0.6788 0.5632 0.2132 0.4076 6.2519 0.6586 0.8044 2.8723 1.6370 2.2973 1.1641 0.6645 1.7759 0.2367 0.5043 0.0949 0.4862 4.3283 1.9687 1.4120 3.1145 1.2684 3.5360 19.7517 1.3102 1.0371 4.6624 22.0647 14.0997 27.0230 48.1578 15.2279 0.2128 17.2528 26.8080 0.1868 0.8125 4.5939 4.2884 1.2183 0.2536 0.3210 0.3275 5.1621 12.6016 13.8481 44.0292 14.2212 102.5470 14.8366 62.5130 0.9565 3.7556 7.5823 0.1287 1.5536 19.8763 53.8483 10.9048 3.1054 9.6793 54.3241 59.1021 21.7339 81.1610 9.9353 51.0396 156.7063 66.9078 11.6192 19.1596 6.2724 22.3289 3.3821 8.9118 489.8346 270.5436 9.4203 65.9045 1.8790 42.6736 11.1667 7.2562 27.7960 18.2119 25.4226 208.7516 240.7934 65.9301 0.8857 11.9310 1.5348 8.0738 385.3718 132.3071 124.6296 3.7609 10.4623 2.3128 12.4127 10.1281 5.6638 7.3711 2.3117 1.7965 1.8325 10.9970 0.3571 0.3349 2.7043
temp: 298.150 k
press: 1.00000 atm
elementType: 17 17 8 8 8 7 7 6 6 6 6 6 6 6 6 6 6 6 6 6 6 6 6 6 6 1 1 1 1 1 1 1 1 1 1 1 1 1 1
symmnumber: 1
zpe: 736026.3 jmol-1
zpe.correction: 0.280338 hartree
zpe.thermalcorrener: 0.303260 hartree
zpe.thermalcorrenthalpy: 0.304204 hartree
zpe.thermalcorrgfe: 0.226060 hartree
zpe.sumelectzpe: -1947.878180 hartree
zpe.sumelectthermal: -1947.855258 hartree
zpe.sumelectthermalent: -1947.854313 hartree
zpe.sumelectthermalfe: -1947.932458 hartree
dipole: -1.1995 3.2908 2.8506
dipole: 4.5159
quadrupole: -178.7066 -145.5602 -165.8801
quadrupole: -8.8948 -6.1820 -3.7928
quadrupole: -15.3243 17.8221 -2.4978 -8.8948 -6.1820 -3.7928
hfenergy: -1948.1585178 hartree
pointgroup: C01 [X(C18H14Cl2N2O3)]
dipole: -0.4831526 -1.2723684 -1.1420766 debye
polarizability: 385.1220932|1.6772386|241.0029037|5.6261702|-1.9459537|122.3881783 unknown
InChI: InChI=1S/C18H14Cl2N2O3/c1-11(23)18(2)16(24)21(14-7-3-12(19)4-8-14)17(25)22(18)15-9-5-13(20)6-10-15/h3-10H,1-2H3
charge 0 multiplicity 1
39 atoms
Cl -6.69799 2.158692 0.049425
Cl 7.068346 1.464907 0.335569
O  1.52452 -2.444681 -0.904602
O  0.2341 1.908638 0.375837
O  -1.250393 -1.926997 1.851496
N  -1.033122 -0.037219 -0.190419
N  1.255563 -0.182716 -0.188635
C  -0.728911 -1.451928 -0.506069
C  0.824672 -1.456782 -0.571985
C  -1.289455 -1.926737 -1.866588
C  0.129803 0.705792 0.046754
C  -1.065833 -2.408931 0.710336
C  -2.36417 0.490691 -0.102821
C  2.632675 0.221228 -0.062121
C  -1.061243 -3.895329 0.421871
C  -2.601863 1.889727 -0.194438
C  -3.472858 -0.383547 0.047116
C  3.592989 -0.719022 0.387213
C  3.028036 1.540651 -0.39381
C  -3.916551 2.395652 -0.143043
C  -4.788765 0.118903 0.090588
C  -4.997912 1.506034 -0.008264
C  4.946439 -0.343079 0.504754
C  4.380087 1.921262 -0.266161
C  5.321637 0.974243 0.178578
H  -0.806912 -2.876049 -2.148925
H  -2.381697 -2.066832 -1.842254
H  -1.056735 -1.178726 -2.643521
H  -1.887887 -4.16937 -0.25989
H  -0.118804 -4.176534 -0.085138
H  -1.167254 -4.453063 1.364584
H  -1.764182 2.582507 -0.280005
H  -3.333702 -1.459807 0.166632
H  3.294873 -1.740283 0.63259
H  2.289987 2.272599 -0.725795
H  -4.089141 3.473519 -0.21007
H  -5.634217 -0.563491 0.213651
H  5.691909 -1.064893 0.849418
H  4.691157 2.939772 -0.513761
