program: Gaussian 09
title: 000271770
version: EM64L-G09RevD.01
frameworkgroup: C1[X(C17H24O2)]
method: RPBEPBE
basis: SDD
operation: Freq
keyword: #pfreq=noraman
keyword: PBEPBE/SDD
title: #p freq=noraman PBEPBE/SDD
converged: NO YES NO NO
title: Mulliken charges:
elementType: O O C C C C C C C C C C C C C C C C C H H H H H H H H H H H H H H H H H H H H H H H H
charge: -0.446147 -0.230087 -0.129583 0.189449 0.319855 -0.487579 -0.507298 -0.424193 -0.553204 0.335828 -0.769699 -0.431763 -0.755696 0.351678 -0.427554 -0.533387 -0.596140 -0.516093 0.147664 0.197460 0.207733 0.198452 0.202424 0.206259 0.201624 0.226382 0.227107 0.234726 0.227424 0.215969 0.240420 0.229965 0.223690 0.203450 0.245880 0.205712 0.226364 0.264254 0.229462 0.226324 0.236944 0.248853 0.337073
chargesum: 0.00000
title: Mulliken charges with hydrogens summed into heavy atoms:
elementType: O O C C C C C C C C C C C C C C C C C
charge: -0.109074 -0.230087 0.067876 0.189449 0.319855 -0.081394 -0.098614 0.003812 -0.091371 0.335828 -0.085886 0.021892 -0.100654 0.351678 -0.201190 -0.269133 -0.140354 -0.030296 0.147664
polarizability: 2.11999614e+02 2.64088813e+01 1.84840083e+02 2.39327517e+00 -9.88669431e+00 1.58567026e+02
1716.lowfreq: -15.6262 -11.5968 -0.0006 -0.0004 -0.0002 12.9957 45.7428 63.4607 81.4373
frequency: 45.5070 63.4178 81.3225 114.1138 142.8321 152.4904 188.7718 196.3621 213.1682 232.8717 243.3284 246.6712 263.6893 276.3391 294.3574 296.5318 322.1169 330.1882 348.5162 373.3868 396.7721 407.6494 424.7101 458.6685 481.2105 508.4427 511.6321 540.2559 550.8117 578.5138 619.2732 660.2880 707.6738 720.8331 764.0342 791.7268 800.3485 820.7047 832.3551 856.7148 876.2503 894.2168 903.2065 906.8853 924.7609 947.1389 951.5152 968.0331 978.3832 996.8466 1005.3122 1010.8415 1029.8164 1038.6751 1053.5300 1076.1562 1085.4192 1096.1444 1101.6062 1142.3750 1148.8949 1165.3382 1174.2693 1184.0597 1198.8193 1205.5792 1220.1523 1230.3200 1252.2300 1260.7840 1270.4080 1287.4589 1299.9187 1316.8676 1322.4480 1329.8254 1338.4486 1340.8382 1343.1871 1349.1915 1351.1893 1371.8630 1379.3329 1385.7932 1398.5595 1440.9308 1447.5355 1453.0694 1458.7608 1465.5704 1466.4238 1476.5376 1479.6909 1482.0028 1488.1461 1493.0700 1564.7197 1583.7993 1652.1813 2938.0671 2954.9672 2961.0809 2965.2823 2970.4267 2974.6255 2975.7403 2977.1999 2983.7078 2991.4611 3012.2612 3017.5810 3029.6415 3040.7966 3046.1714 3066.7525 3068.5022 3071.1811 3079.4602 3083.4540 3087.4634 3095.3419 3154.2827 3572.4173
redmass: 6.6920 3.7619 4.3246 2.4028 2.8487 3.7879 4.1095 1.1358 1.9176 1.6268 2.7476 2.0405 2.0754 2.0816 2.0706 2.0415 2.3648 2.1435 2.9056 2.6664 3.1993 3.1388 2.2947 3.7427 4.1488 3.0618 3.8491 2.1555 3.3426 2.7599 3.3687 3.6748 3.0992 4.0331 2.6069 2.0297 2.4101 1.8825 2.4692 1.7774 2.2720 1.4558 1.7587 1.7609 1.9963 1.7667 2.2482 4.1312 1.5775 2.1421 2.1728 1.8394 2.2330 1.7653 2.8518 1.4653 1.7096 1.7358 1.8798 2.2482 1.3036 1.5468 1.4834 1.8661 1.6645 2.6075 1.5258 1.6563 1.7443 1.5276 1.8550 1.6364 1.4021 1.6443 1.4407 1.2857 1.5792 1.3696 1.4570 1.6756 1.4806 1.1828 1.2545 1.1975 2.4015 1.0887 1.0839 1.0757 1.0908 1.0641 1.0645 1.0736 1.0795 1.0692 1.0754 1.0652 10.1949 6.9330 7.3045 1.0766 1.0761 1.0604 1.0668 1.0592 1.0376 1.0408 1.0638 1.0636 1.0628 1.0973 1.0870 1.0949 1.1025 1.0959 1.0987 1.0992 1.0956 1.1002 1.0979 1.0991 1.0906 1.0893 1.0662
irintensity: 2.9463 1.2206 0.2158 7.0907 2.3745 0.2292 7.6498 0.3239 2.5061 1.0567 0.5544 7.1504 38.8530 46.8107 1.1186 24.6654 2.6000 7.5751 2.0523 0.6542 0.9326 6.0236 1.3020 5.9955 5.5440 1.3386 1.6920 2.0889 0.6778 0.8232 1.3492 3.2014 4.3129 0.6875 3.0015 3.8349 4.3258 6.4511 9.5165 23.9268 1.2859 25.8529 0.1925 0.9654 10.1625 3.6463 4.9838 91.2938 14.8041 9.4340 1.6018 5.3606 2.8805 1.6565 0.6320 1.4247 4.3230 4.3934 18.5022 3.3107 5.8750 13.0771 6.6176 11.3466 41.9196 5.3454 2.6007 12.3196 6.1492 5.6758 51.4490 16.4220 3.9454 5.0209 1.6639 9.0971 6.9584 2.0967 1.9953 9.7140 2.0155 10.6919 11.4697 19.7524 14.4674 17.4021 13.3158 0.9709 13.6494 24.3146 0.5668 14.4804 4.2639 2.2399 15.2938 26.1630 26.4183 347.7612 6.0723 12.9050 32.2726 37.0217 21.6597 12.9885 37.4670 69.6961 22.8019 19.4867 35.3466 46.0572 24.4997 34.2559 60.6332 25.5509 34.5703 31.9208 22.3544 16.7615 20.7391 28.1265 23.3542 5.9331 7.0504
temp: 298.150 k
press: 1.00000 atm
elementType: 8 8 6 6 6 6 6 6 6 6 6 6 6 6 6 6 6 6 6 1 1 1 1 1 1 1 1 1 1 1 1 1 1 1 1 1 1 1 1 1 1 1 1
symmnumber: 1
zpe: 975206.5 jmol-1
zpe.correction: 0.371437 hartree
zpe.thermalcorrener: 0.389610 hartree
zpe.thermalcorrenthalpy: 0.390554 hartree
zpe.thermalcorrgfe: 0.327454 hartree
zpe.sumelectzpe: -811.175879 hartree
zpe.sumelectthermal: -811.157706 hartree
zpe.sumelectthermalent: -811.156762 hartree
zpe.sumelectthermalfe: -811.219861 hartree
dipole: 3.1028 3.4271 1.5459
dipole: 4.8747
quadrupole: -131.3158 -114.0323 -119.0186
quadrupole: -12.8946 9.2682 -3.3190
quadrupole: -9.8602 7.4232 2.4370 -12.8946 9.2682 -3.3190
hfenergy: -811.5473154 hartree
pointgroup: C01 [X(C17H24O2)]
dipole: 1.2238723 1.2117144 0.843788 debye
polarizability: 211.825025|25.5434168|188.0112922|6.7660156|-4.3745146|155.5704059 unknown
InChI: InChI=1S/C17H24O2/c1-16(11-18)8-3-9-17(2)14-10-13(19)6-4-12(14)5-7-15(16)17/h5,10,15,18H,3-4,6-9,11H2,1-2H3
charge 0 multiplicity 1
43 atoms
O  2.017237 -1.013946 -2.795573
O  -3.825711 -1.985412 -0.306805
C  1.5217 0.83431 0.637008
C  0.330656 0.134974 1.407155
C  2.234698 -0.040898 -0.471762
C  0.78494 -1.270468 1.891769
C  2.584825 -1.434372 0.134257
C  1.38019 -2.15205 0.774884
C  1.093166 2.246441 0.145157
C  -0.943722 0.112425 0.540857
C  -0.010662 0.977752 2.68074
C  1.35553 -0.212526 -1.748517
C  3.572787 0.630293 -0.888952
C  -1.260651 1.343605 -0.214595
C  -0.319476 2.321484 -0.384897
C  -1.831645 -0.946287 0.525623
C  -2.685798 1.491573 -0.728846
C  -3.223842 0.166196 -1.314706
C  -3.027507 -0.996202 -0.338045
H  2.309512 0.982062 1.40837
H  -0.04872 -1.785721 2.40543
H  1.566236 -1.11602 2.6651
H  3.361625 -1.289443 0.913508
H  3.05838 -2.065295 -0.644498
H  1.704187 -3.121224 1.200721
H  0.608033 -2.385965 0.016297
H  1.795519 2.620374 -0.623479
H  1.185009 2.972506 0.982158
H  -0.763104 0.448929 3.293946
H  0.897878 1.118461 3.296609
H  -0.419795 1.970939 2.429577
H  1.187417 0.76608 -2.22746
H  0.369267 -0.650111 -1.502417
H  4.239609 0.757475 -0.014924
H  4.086384 -0.000514 -1.635522
H  3.42399 1.620886 -1.355501
H  -0.599973 3.239828 -0.921175
H  -1.666906 -1.843456 1.131104
H  -3.34097 1.790083 0.116068
H  -2.742027 2.298831 -1.481606
H  -2.677347 -0.083635 -2.247725
H  -4.294855 0.234191 -1.572791
H  1.985936 -1.968755 -2.537241
