program: Gaussian 09
title: 000271753
version: EM64L-G09RevD.01
frameworkgroup: C1[X(C11H12Br2O2)]
method: RPBEPBE
basis: SDD
operation: Freq
keyword: #p
keyword: freq=noraman
keyword: PBEPBE/SDD
title: #p freq=noraman PBEPBE/SDD
converged: YES YES NO NO
title: Mulliken charges:
elementType: Br Br O O C C C C C C C C C C C H H H H H H H H H H H H
charge: 0.015175 0.017862 -0.301890 -0.383652 -0.024661 -0.627138 -0.705543 -0.693363 0.289050 0.192674 0.136955 -0.230514 -0.340056 -0.280514 -0.154471 0.264607 0.295869 0.206002 0.228486 0.249452 0.206306 0.243622 0.221146 0.257961 0.268776 0.258366 0.389497
chargesum: 0.00000
title: Mulliken charges with hydrogens summed into heavy atoms:
elementType: Br Br O O C C C C C C C C C C C
charge: 0.015175 0.017862 -0.301890 0.005845 0.239945 -0.331269 -0.021604 -0.022290 0.289050 0.192674 0.136955 0.027447 -0.071280 -0.280514 0.103895
polarizability: 2.12929155e+02 -4.20203119e+00 1.73646966e+02 -2.13229451e+00 -1.29172260e+00 1.10046610e+02
1716.lowfreq: -8.4427 -4.5392 -2.8290 -0.0002 0.0003 0.0003 24.8863 39.4688 63.2612
frequency: 24.7501 39.4423 63.2563 75.2676 107.6120 140.9119 146.9707 167.2588 195.6572 196.7422 224.7533 263.7516 266.2601 301.5057 312.8773 337.3928 398.9428 420.9660 431.1393 446.5855 493.7910 516.3960 580.0964 610.8185 677.4781 698.9350 760.1174 772.6457 830.7352 834.9992 848.1302 876.5181 923.0220 931.3772 936.4084 959.0530 967.9482 1004.8505 1069.1984 1098.6953 1120.2210 1129.6095 1153.9782 1179.9380 1215.9293 1256.1746 1265.5936 1283.5781 1298.9429 1334.6692 1370.9959 1380.4160 1385.3284 1398.3366 1401.5770 1457.2814 1464.1388 1471.7423 1480.0519 1491.0753 1535.1972 1564.3208 1625.8397 2794.2716 2978.8315 2983.0805 3030.6415 3070.1671 3073.4600 3083.4547 3095.0552 3098.6881 3163.3829 3173.7345 3185.0499
redmass: 9.5008 6.1149 3.0041 4.8481 9.1351 4.2815 5.8302 7.6914 1.7028 1.5738 1.5767 3.1183 13.8273 3.5900 6.9178 4.1623 2.6226 4.5312 3.5192 5.1734 4.0417 3.4784 5.1362 8.1504 7.1376 4.6821 3.5780 5.6076 1.5731 3.8725 3.2310 1.5960 1.4109 1.7576 1.0961 1.3943 1.3446 2.6543 2.3673 1.6041 1.9721 1.5421 1.5835 1.8809 1.5710 1.5902 2.5962 1.8972 1.3426 1.7053 1.6839 1.3687 4.0453 3.1476 1.5116 2.3983 1.0574 1.0439 1.0545 1.0511 5.2699 3.6502 5.0039 1.0703 1.0376 1.0371 1.0837 1.0981 1.0898 1.0944 1.0993 1.0993 1.0892 1.0918 1.0974
irintensity: 0.3597 0.4029 0.0989 0.2881 1.2019 0.0594 0.8419 0.9776 0.0928 0.1121 0.7391 4.5455 1.2143 2.0892 1.8752 8.4319 3.5562 2.9741 1.8367 7.1715 11.6006 27.1276 11.1739 26.4546 38.3703 9.1810 4.7706 7.9279 57.1933 27.8316 3.0698 7.3405 6.2277 32.6298 128.6699 4.2530 0.0099 13.0387 16.0241 12.4064 5.0061 2.4489 31.3571 8.0332 61.0256 67.2084 145.9205 77.9688 2.7222 104.3782 73.1845 44.0098 31.1899 17.2547 47.9615 195.8084 9.7123 6.6309 10.0818 32.9152 53.6923 70.2151 101.3475 262.9251 23.1070 30.3776 1.2513 8.1816 3.2753 61.0560 19.5633 28.1614 0.8130 0.9373 2.9588
temp: 298.150 k
press: 1.00000 atm
elementType: 35 35 8 8 6 6 6 6 6 6 6 6 6 6 6 1 1 1 1 1 1 1 1 1 1 1 1
symmnumber: 1
zpe: 532027.2 jmol-1
zpe.correction: 0.202638 hartree
zpe.thermalcorrener: 0.218379 hartree
zpe.thermalcorrenthalpy: 0.219324 hartree
zpe.thermalcorrgfe: 0.156940 hartree
zpe.sumelectzpe: -602.633551 hartree
zpe.sumelectthermal: -602.617810 hartree
zpe.sumelectthermalent: -602.616866 hartree
zpe.sumelectthermalfe: -602.679250 hartree
dipole: -0.0430 -0.6055 2.2527
dipole: 2.3331
quadrupole: -102.1050 -114.0407 -108.6577
quadrupole: 6.6752 -7.0095 -0.4391
quadrupole: 6.1628 -5.7729 -0.3899 6.6752 -7.0095 -0.4391
hfenergy: -602.8361891 hartree
pointgroup: C01 [X(C11H12Br2O2)]
dipole: -0.1489809 -0.7359242 0.5280044 debye
polarizability: 207.8204002|-13.8032798|152.1305702|-4.5715081|33.2794019|136.6717607 unknown
InChI: InChI=1S/C11H12Br2O2/c1-6(2)10(13)11(15)8-5-7(12)3-4-9(8)14/h3-6,10,14H,1-2H3
charge 0 multiplicity 1
27 atoms
Br -2.036742 -0.03077 -2.379777
Br 3.276039 -2.75676 -1.727373
O  -1.114118 1.58503 0.649995
O  1.252921 2.361589 1.022936
C  -3.105765 -0.440472 0.403105
C  -1.783594 -0.504543 -0.381369
C  -2.816193 -0.856659 1.875011
C  -4.196969 -1.350482 -0.200876
C  -0.721407 0.493568 0.081567
C  0.715346 0.229247 -0.089308
C  1.658478 1.202341 0.41457
C  1.219577 -0.945617 -0.72835
C  3.053764 0.971983 0.28615
C  2.59712 -1.142514 -0.844231
C  3.524609 -0.192047 -0.337059
H  -3.449502 0.610156 0.401178
H  -1.402721 -1.537633 -0.425239
H  -2.436993 -1.895168 1.930464
H  -3.753785 -0.811595 2.456838
H  -2.087761 -0.18533 2.359674
H  -3.859265 -2.403956 -0.246606
H  -4.476898 -1.035132 -1.219915
H  -5.103153 -1.314908 0.430006
H  0.531599 -1.68252 -1.149806
H  3.74268 1.723624 0.68013
H  4.600018 -0.365853 -0.436128
H  0.218218 2.363124 1.019912
