program: Gaussian 09
title: 000271809
version: EM64L-G09RevD.01
frameworkgroup: C1[X(C24H15NO2)]
method: RPBEPBE
basis: SDD
operation: Freq
keyword: #p
keyword: freq=noraman
keyword: PBEPBE/SDD
title: #p freq=noraman PBEPBE/SDD
converged: YES YES NO NO
title: Mulliken charges:
elementType: O O N C C C C C C C C C C C C C C C C C C C C C C C C H H H H H H H H H H H H H H H
charge: -0.199020 -0.214842 -0.454439 0.163132 0.121164 0.114990 0.202182 0.334574 0.251783 -0.160735 -0.373766 0.254583 -0.576613 -0.367333 0.245254 -0.024437 -0.262387 -0.213571 -0.398274 -0.347829 -0.380181 -0.367716 -0.233125 -0.227990 -0.227250 -0.245976 -0.236233 0.321960 0.253088 0.286855 0.233779 0.226401 0.225875 0.250174 0.286371 0.281903 0.286547 0.237671 0.238294 0.230467 0.232380 0.232291
chargesum: 0.00000
title: Mulliken charges with hydrogens summed into heavy atoms:
elementType: O O N C C C C C C C C C C C C C C C C C C C C C C C C
charge: -0.199020 -0.214842 -0.132479 0.163132 0.121164 0.114990 0.202182 0.334574 0.251783 -0.160735 -0.120679 0.254583 -0.289758 -0.133554 0.245254 -0.024437 -0.035987 0.012304 -0.148100 -0.061459 -0.098278 -0.081169 0.004546 0.010304 0.003216 -0.013596 -0.003942
polarizability: 4.08428682e+02 -1.49616637e+01 3.25937149e+02 -8.83719890e+00 -2.70903131e+01 1.77499213e+02
1716.lowfreq: -25.7064 -7.1645 -2.0609 -0.0009 -0.0001 0.0004 5.2645 27.2647 31.2773
frequency: -25.6842 27.2268 31.2649 58.4787 63.5415 79.1980 105.9059 132.7047 165.3532 168.6054 193.0987 204.5085 220.8885 262.1403 280.0449 289.5792 316.9548 356.6346 375.5643 402.4097 407.9711 429.2439 450.1190 454.4672 468.5657 473.4735 507.2330 558.7369 573.5141 578.8759 586.7368 590.7362 612.6928 633.6821 655.8119 667.6531 671.7281 695.6746 705.7889 706.9422 728.1446 754.3369 763.2773 772.6097 788.4399 798.9191 806.5817 828.3858 837.9855 855.5323 856.2724 898.3222 916.0842 931.3488 933.3061 942.5369 978.2121 979.6666 988.4457 992.6526 994.9360 999.8341 1011.9561 1015.4858 1024.5095 1034.2410 1074.9794 1080.1419 1087.2560 1114.9465 1123.8937 1166.6725 1170.7790 1173.5450 1191.6430 1194.1709 1225.9804 1247.2128 1253.2390 1258.7593 1295.8406 1303.3692 1308.5078 1319.1955 1346.9864 1369.3804 1397.7722 1410.9980 1425.4120 1432.3380 1441.1911 1451.6905 1468.0048 1474.2100 1479.6532 1515.5918 1538.2709 1551.4086 1573.3398 1580.5916 1586.4732 1603.4106 1608.9978 1614.0288 1627.7615 3124.5714 3129.3337 3133.1903 3134.9854 3138.7725 3146.3413 3149.0620 3149.8193 3153.3452 3161.0494 3162.2990 3167.4603 3170.6448 3185.6123 3591.7470
redmass: 4.2950 6.0107 6.8448 4.8183 5.6631 5.0624 5.9550 5.7029 5.3861 7.4584 5.1349 5.3995 5.3001 6.4371 6.3636 5.1543 5.9117 8.2342 5.8474 3.1558 3.3321 3.9004 4.2600 6.1596 5.2994 7.7885 4.3978 5.7258 5.2242 4.9901 1.1415 4.4395 5.9871 6.1257 6.0456 4.3828 4.7874 5.7422 1.8010 5.3880 3.2461 1.5271 3.1529 2.0509 2.1599 2.8548 5.5065 4.2699 4.6659 1.4374 1.2527 4.8088 1.4064 1.5875 1.4813 1.4394 1.3051 1.3942 5.5267 1.4742 5.1994 1.3403 1.3601 2.2453 2.5113 2.1712 3.1016 1.6327 2.8114 1.7520 1.9431 1.1574 1.0792 1.0537 1.1710 2.2994 2.0784 1.6671 1.9929 1.8437 3.5897 2.8063 2.2819 1.5120 2.2599 6.1888 9.9553 5.4456 2.6379 2.5472 2.5469 3.3855 2.7568 2.9508 2.9429 7.2112 7.9232 7.9879 7.6523 5.8883 6.3888 7.6125 6.8594 6.3235 7.0329 1.0854 1.0854 1.0889 1.0861 1.0892 1.0942 1.0926 1.0902 1.0940 1.0946 1.0996 1.1001 1.1002 1.0957 1.0806
irintensity: 0.4010 2.5074 0.2496 0.4590 1.4359 0.1355 4.1677 1.3061 0.8180 2.6696 1.1438 3.5628 1.8090 0.5946 0.6322 1.2260 1.8634 11.1588 14.8217 0.3592 2.1483 7.1562 2.1737 2.8812 3.3586 0.1768 10.5080 22.1752 20.5333 0.1879 72.2481 0.5622 1.7663 2.5924 5.1426 5.6999 1.4880 10.4366 60.6002 2.6789 46.5236 88.0850 6.1747 27.8509 31.1740 28.7263 32.7297 7.9018 4.9239 2.0262 5.4365 4.0346 5.7228 6.5431 10.6929 2.4489 0.8801 2.8096 0.9568 2.3574 17.9542 1.9052 0.4373 6.9359 14.4480 7.0127 7.8309 8.0202 8.3839 3.4466 56.8988 1.1656 11.7817 0.0832 8.5884 1.6324 7.4312 52.2891 126.3486 70.3100 13.8714 440.9816 3.9350 4.2380 95.9141 2.1155 0.9917 21.7751 44.8997 26.8180 0.0761 83.0261 34.2202 45.4907 15.3420 54.5580 69.4221 185.2503 230.1749 2.4599 0.2409 153.0772 5.1290 13.5605 2.6509 1.3725 0.4605 4.1266 3.9577 6.3882 25.9677 17.3096 12.1592 9.0391 3.0365 32.5681 32.6271 32.2286 3.5262 86.2532
temp: 298.150 k
press: 1.00000 atm
elementType: 8 8 7 6 6 6 6 6 6 6 6 6 6 6 6 6 6 6 6 6 6 6 6 6 6 6 6 1 1 1 1 1 1 1 1 1 1 1 1 1 1 1
symmnumber: 1
zpe: 833687.4 jmol-1
zpe.correction: 0.317535 hartree
zpe.thermalcorrener: 0.337158 hartree
zpe.thermalcorrenthalpy: 0.338102 hartree
zpe.thermalcorrgfe: 0.268807 hartree
zpe.sumelectzpe: -1126.974160 hartree
zpe.sumelectthermal: -1126.954537 hartree
zpe.sumelectthermalent: -1126.953593 hartree
zpe.sumelectthermalfe: -1127.022888 hartree
dipole: 1.7620 3.7609 -0.4665
dipole: 4.1793
quadrupole: -123.1191 -147.5636 -161.2279
quadrupole: -4.9592 8.0085 7.1731
quadrupole: 20.8511 -3.5934 -17.2577 -4.9592 8.0085 7.1731
hfenergy: -1127.291695 hartree
pointgroup: C01 [X(C24H15N1O2)]
dipole: -0.6926701 1.3990705 0.5161127 debye
polarizability: 408.9016867|12.8481899|303.5408245|3.9860314|59.8237071|199.4225325 unknown
InChI: InChI=1S/C24H15NO2/c26-21-14-19(24(27)17-11-5-4-10-16(17)21)22-18-12-6-7-13-20(18)25-23(22)15-8-2-1-3-9-15/h1-14,25H
charge 0 multiplicity 1
42 atoms
O  0.852249 0.30755 1.933251
O  2.632706 -2.46028 -2.442077
N  -3.175871 0.478491 0.185873
C  -1.125449 -0.492995 -0.038341
C  -2.156946 -1.508741 -0.252217
C  -1.797747 0.723256 0.235781
C  -3.43179 -0.869675 -0.089008
C  0.314489 -0.718834 -0.192651
C  -1.356777 2.143272 0.348804
C  1.275713 -0.200471 0.847643
C  -2.123202 -2.90328 -0.515677
C  2.741713 -0.367912 0.603099
C  0.813072 -1.489556 -1.229961
C  -4.655044 -1.564863 -0.187172
C  3.216101 -1.13197 -0.50017
C  2.242066 -1.75388 -1.450404
C  -3.339355 -3.606989 -0.620291
C  -4.592327 -2.946172 -0.46334
C  -1.582356 3.009383 -0.758028
C  -0.798701 2.679136 1.538301
C  3.668092 0.218632 1.500428
C  4.60674 -1.304623 -0.694455
C  5.053222 0.051299 1.297179
C  5.523664 -0.712236 0.198728
C  -1.242033 4.377845 -0.68169
C  -0.465801 4.049717 1.613409
C  -0.683621 4.902619 0.50682
H  -3.876703 1.201534 0.342762
H  -1.170541 -3.430979 -0.627644
H  0.139144 -1.902137 -1.988734
H  -5.617466 -1.059247 -0.051909
H  -3.324624 -4.682887 -0.825218
H  -5.520189 -3.521535 -0.552847
H  -2.005468 2.601291 -1.683534
H  -0.621118 2.014721 2.3871
H  3.280637 0.793328 2.34755
H  4.938736 -1.9037 -1.548513
H  5.767295 0.508892 1.990194
H  6.60034 -0.84309 0.045434
H  -1.408713 5.02955 -1.546512
H  -0.035354 4.449698 2.538036
H  -0.420381 5.964534 0.5687
