program: Gaussian 09
title: 000271746
version: EM64L-G09RevD.01
frameworkgroup: C1[X(C11H13NO2)]
method: RPBEPBE
basis: SDD
operation: Freq
keyword: #p
keyword: freq=noraman
keyword: PBEPBE/SDD
title: #p freq=noraman PBEPBE/SDD
converged: YES YES NO NO
title: Mulliken charges:
elementType: O O N C C C C C C C C C C C H H H H H H H H H H H H H
charge: -0.309784 -0.284817 -0.460644 -0.127846 -0.479118 -0.504424 -0.321367 0.276600 0.475784 -0.441417 -0.356228 -0.195780 -0.210226 -0.257587 0.245356 0.234787 0.262496 0.225482 0.244851 0.227160 0.226892 0.328347 0.221927 0.298939 0.226079 0.225968 0.228570
chargesum: 0.00000
title: Mulliken charges with hydrogens summed into heavy atoms:
elementType: O O N C C C C C C C C C C C
charge: -0.309784 -0.284817 -0.132297 0.117510 0.018166 -0.034091 0.132685 0.276600 0.475784 -0.219490 -0.057289 0.030298 0.015741 -0.029017
polarizability: 1.98813384e+02 -4.87903135e+00 1.22235398e+02 -1.29499953e+01 -9.68506678e+00 7.83603800e+01
1716.lowfreq: -22.8682 -8.6773 -5.3252 0.0005 0.0006 0.0007 31.8235 37.3192 64.2685
frequency: 31.1854 36.1378 64.2319 85.8508 92.4033 132.4429 227.3885 251.7157 262.3944 293.7155 341.9381 360.5376 408.0198 473.2920 509.5200 605.4609 617.0815 643.2560 667.2776 695.9732 699.9914 765.8510 767.0629 795.0659 815.6017 832.0072 841.6027 883.0733 900.8801 913.3803 926.6911 971.4201 982.8598 988.9740 996.1349 1005.8537 1028.4816 1044.4886 1071.6218 1089.9716 1101.9268 1160.3438 1166.7957 1172.5783 1177.4963 1189.8413 1210.6112 1258.7737 1264.1152 1325.0277 1336.5857 1384.8295 1392.2126 1433.0797 1444.0912 1450.7688 1471.5765 1485.8924 1515.8513 1600.4091 1617.1442 1662.6236 3019.7230 3091.4949 3096.2657 3106.3660 3115.1445 3128.4546 3132.5440 3144.6324 3165.5359 3190.1707 3195.5388 3216.6941 3541.8969
redmass: 4.4677 3.9883 2.8072 7.4890 4.6304 4.1382 3.4920 3.9648 5.8067 4.0181 4.9376 2.4913 2.9270 3.8901 2.8448 5.5721 5.9585 1.3213 5.9713 2.2875 4.0033 1.6168 1.3660 1.5277 2.8052 2.3563 1.2650 4.4328 2.2626 1.4308 1.9929 1.3536 5.9699 5.7183 1.3036 2.5950 2.0440 1.3129 1.2530 1.5590 1.1651 3.0639 1.4837 1.0527 1.8870 1.1128 1.6354 2.0890 1.2277 1.3904 1.2631 4.5800 1.8555 2.3449 1.0890 1.1336 1.2993 2.2327 2.2562 5.3195 6.0183 8.1538 1.0586 1.1040 1.0528 1.0617 1.0879 1.0928 1.0870 1.0936 1.0996 1.0952 1.1169 1.1152 1.0759
irintensity: 1.0414 0.3410 0.1767 4.5976 0.1548 1.2697 0.8444 3.3738 8.1921 12.9310 2.7434 8.4139 0.0075 11.1255 26.7086 0.3494 1.7556 27.4207 13.2943 8.6591 75.8020 95.6638 15.2385 6.6458 2.4459 30.1270 0.4991 0.3930 2.3256 14.0948 25.0796 0.0513 108.3465 238.1305 2.9598 23.0211 2.8816 54.5952 23.3962 26.9058 4.9050 351.2135 22.2467 1.5539 13.4957 5.9047 2.5520 5.2173 7.4260 47.2456 3.6651 58.6335 3.5549 107.9615 17.5938 16.8776 8.5427 16.7535 512.8688 29.3181 103.9250 219.9824 38.7609 10.3823 20.2744 12.2356 13.4830 15.2043 0.7900 32.3952 23.3743 6.0803 5.1809 19.6455 30.7453
temp: 298.150 k
press: 1.00000 atm
elementType: 8 8 7 6 6 6 6 6 6 6 6 6 6 6 1 1 1 1 1 1 1 1 1 1 1 1 1
symmnumber: 1
zpe: 574733.1 jmol-1
zpe.correction: 0.218904 hartree
zpe.thermalcorrener: 0.231878 hartree
zpe.thermalcorrenthalpy: 0.232822 hartree
zpe.thermalcorrgfe: 0.177609 hartree
zpe.sumelectzpe: -631.120116 hartree
zpe.sumelectthermal: -631.107142 hartree
zpe.sumelectthermalent: -631.106198 hartree
zpe.sumelectthermalfe: -631.161411 hartree
dipole: 0.5597 -1.8978 0.9138
dipole: 2.1794
quadrupole: -68.9940 -78.5792 -84.4784
quadrupole: -0.8947 -1.3623 -1.7427
quadrupole: 8.3565 -1.2287 -7.1279 -0.8947 -1.3623 -1.7427
hfenergy: -631.3390205 hartree
pointgroup: C01 [X(C11H13N1O2)]
dipole: 0.2177619 -0.6350795 -0.5333759 debye
polarizability: 197.9462374|11.9266032|93.7112654|-12.3487656|22.5256863|107.7516593 unknown
InChI: InChI=1S/C11H13NO2/c13-11(14-8-9-6-7-9)12-10-4-2-1-3-5-10/h1-5,9,12H,6-8H2
charge 0 multiplicity 1
27 atoms
O  1.763848 -0.155437 -1.401836
O  0.911279 1.136633 0.384379
N  -0.421047 -0.357993 -0.887477
C  3.915398 -0.56142 -0.226163
C  3.770935 -0.457551 1.300534
C  5.058144 0.029854 0.622394
C  3.137159 0.369303 -1.128073
C  0.74976 0.289866 -0.530258
C  -1.712761 -0.214762 -0.309513
C  -2.765239 -0.989989 -0.867348
C  -1.978654 0.654483 0.781707
C  -4.069356 -0.898678 -0.34074
C  -3.290788 0.733154 1.296311
C  -4.34215 -0.035538 0.7462
H  4.080119 -1.562389 -0.640159
H  3.812441 -1.384536 1.879532
H  3.075382 0.293297 1.684741
H  5.22838 1.110056 0.569735
H  5.969806 -0.562757 0.737098
H  3.588879 0.439037 -2.131684
H  3.044516 1.37594 -0.681475
H  -0.325209 -1.012507 -1.667022
H  -2.561514 -1.661773 -1.711162
H  -1.167841 1.24907 1.207161
H  -4.871371 -1.50186 -0.780498
H  -3.489872 1.405629 2.138401
H  -5.355344 0.03577 1.155418
