program: Gaussian 09
title: 000271771
version: EM64L-G09RevD.01
frameworkgroup: C1[X(C17H22O3)]
method: RPBEPBE
basis: SDD
operation: Freq
keyword: #pfreq=noraman
keyword: PBEPBE/SDD
title: #p freq=noraman PBEPBE/SDD
converged: YES YES NO NO
title: Mulliken charges:
elementType: O O O C C C C C C C C C C C C C C C C C H H H H H H H H H H H H H H H H H H H H H H
charge: -0.421280 -0.230195 -0.230502 0.184025 -0.168369 0.225341 -0.489331 -0.463074 -0.427653 -0.542647 0.351043 -0.767063 0.352720 -0.765396 -0.429749 0.096108 -0.536255 -0.597132 -0.516241 0.146335 0.243883 0.201833 0.209600 0.231248 0.208475 0.234436 0.206374 0.239565 0.241857 0.241600 0.219227 0.225928 0.237568 0.249553 0.231562 0.226341 0.225385 0.229278 0.264997 0.249115 0.234371 0.377118
chargesum: 0.00000
title: Mulliken charges with hydrogens summed into heavy atoms:
elementType: O O O C C C C C C C C C C C C C C C C C
charge: -0.044163 -0.230195 -0.230502 0.184025 0.075514 0.225341 -0.077898 -0.023350 0.013157 -0.061226 0.351043 -0.080308 0.352720 -0.046713 -0.203408 0.096108 -0.271258 -0.142469 -0.032754 0.146335
polarizability: 2.22683914e+02 -2.31068213e+01 1.80358399e+02 1.66743443e+01 -6.58173492e+00 1.57855754e+02
1716.lowfreq: -20.1677 -7.6613 -0.0005 -0.0003 -0.0002 4.5453 42.4207 45.1205 72.6242
frequency: 42.3631 45.0740 72.5332 82.6662 145.0750 152.3701 175.3594 203.5485 215.5066 224.7806 239.9016 247.0015 276.7441 284.4350 288.4366 301.5671 319.9292 335.9061 348.8725 384.6154 394.0531 407.9669 441.3541 467.7934 491.5031 511.3312 518.9213 537.9920 561.7207 595.2326 599.9128 621.8406 655.1202 700.8234 723.2668 724.6642 764.3880 795.1361 799.8680 827.6576 833.1902 863.3466 867.1022 888.4511 901.0308 928.2101 929.2450 947.9628 973.8887 989.9552 997.2190 1009.9738 1025.2466 1030.8724 1034.1759 1054.6093 1072.4030 1089.3493 1102.2848 1134.4758 1147.5012 1150.7267 1172.2493 1181.9506 1186.0606 1199.6182 1205.1992 1217.6030 1250.9632 1271.1773 1276.7068 1282.5620 1291.8143 1300.0194 1319.1510 1327.7467 1337.4315 1340.9650 1345.5073 1349.5371 1359.1863 1380.5205 1398.7234 1400.6553 1443.0896 1455.5682 1459.1140 1461.5723 1464.0223 1469.1977 1479.6049 1481.0674 1486.6411 1490.3370 1566.4171 1587.0222 1633.3377 1653.3209 2956.2987 2965.2376 2971.4190 2972.2726 2977.7272 2977.9781 2993.6662 2994.8225 3004.7857 3011.4159 3031.8585 3043.9538 3045.8187 3056.5866 3070.9043 3071.1015 3088.9602 3095.7439 3098.4947 3108.7765 3151.5407 3509.1773
redmass: 10.8098 7.4778 4.1083 3.7380 4.8039 2.8951 3.9529 1.8304 3.9105 1.7054 2.6885 2.3981 1.6300 2.0220 2.2371 1.9355 2.2665 3.4409 3.0389 2.4674 3.5981 4.2242 3.3008 3.3669 3.9431 3.2742 2.9753 2.9911 3.0254 1.2908 3.0699 3.3961 3.4956 3.2807 4.4898 3.9063 2.6615 2.7623 2.2585 1.5443 2.7389 1.7496 2.4083 2.0405 1.4948 2.3450 1.7538 2.1069 1.8429 1.9028 2.2064 1.7688 2.2345 2.1832 2.4392 2.9285 1.9913 1.6353 1.7933 2.3934 1.6464 1.3770 1.8913 1.4601 2.0401 1.5994 1.8011 1.8248 1.5773 1.7659 2.1739 2.0150 1.5486 1.4026 1.5886 1.3381 1.5169 1.4206 1.4686 1.6887 1.3608 1.2547 1.1998 2.4254 1.0896 1.0896 1.0915 1.0777 1.0606 1.0810 1.0600 1.0721 1.0685 1.0582 10.3592 6.8251 8.9093 7.2933 1.0682 1.0664 1.0644 1.0593 1.0414 1.0624 1.0815 1.0619 1.0366 1.0905 1.0960 1.0964 1.0980 1.1010 1.0958 1.0994 1.0991 1.0905 1.0992 1.1001 1.0901 1.0640
irintensity: 1.4606 2.8499 1.4207 0.5355 0.5766 4.7803 0.4903 0.7083 1.1089 0.6294 0.6960 0.4842 0.3192 1.8317 0.5773 0.0890 3.1793 1.9439 3.3677 1.3642 1.8818 7.0740 2.1253 0.5636 9.3869 9.3359 3.8464 4.0515 1.1195 95.8284 44.3818 2.3256 3.1715 20.2197 9.9612 9.7155 2.8825 3.2881 7.2600 4.6709 6.1543 19.4709 3.8315 6.6293 9.0937 2.3983 2.8210 4.6612 43.2008 10.7289 5.6657 15.5789 118.9209 68.6274 83.5270 13.7474 0.7415 5.0931 4.1564 1.3770 17.5505 10.6356 20.8855 6.6181 4.1241 45.2362 0.3062 2.4237 0.5913 41.2712 21.4461 26.8639 6.9466 3.9046 6.7503 1.2110 4.1468 2.7453 4.2318 8.6277 1.2370 10.9837 9.6375 17.1066 14.4864 22.3774 13.1875 2.7666 10.5206 11.6858 8.7791 10.6659 16.3575 26.8412 46.6284 325.9937 189.1393 5.0862 16.9497 23.5340 22.7933 9.7481 32.7315 33.5747 27.7322 26.8970 11.2733 19.5477 29.3684 29.8031 34.9948 38.6007 14.3124 37.1266 24.4388 23.5589 17.3355 19.8824 6.1694 27.4103
temp: 298.150 k
press: 1.00000 atm
elementType: 8 8 8 6 6 6 6 6 6 6 6 6 6 6 6 6 6 6 6 6 1 1 1 1 1 1 1 1 1 1 1 1 1 1 1 1 1 1 1 1 1 1
symmnumber: 1
zpe: 928437.6 jmol-1
zpe.correction: 0.353623 hartree
zpe.thermalcorrener: 0.372025 hartree
zpe.thermalcorrenthalpy: 0.372969 hartree
zpe.thermalcorrgfe: 0.308712 hartree
zpe.sumelectzpe: -885.171787 hartree
zpe.sumelectthermal: -885.153385 hartree
zpe.sumelectthermalent: -885.152441 hartree
zpe.sumelectthermalfe: -885.216698 hartree
dipole: 3.3070 -2.0046 0.7102
dipole: 3.9318
quadrupole: -137.8578 -116.1648 -119.5204
quadrupole: 15.1140 -11.4743 5.9511
quadrupole: -13.3435 8.3495 4.9940 15.1140 -11.4743 5.9511
hfenergy: -885.52541 hartree
pointgroup: C01 [X(C17H22O3)]
dipole: 1.3006665 0.8024839 -0.2391137 debye
polarizability: 222.7431648|23.9068316|180.9731187|-15.33743|-5.5148079|157.1817843 unknown
InChI: InChI=1S/C17H22O3/c1-16-8-3-9-17(2,15(19)20)14(16)7-5-11-4-6-12(18)10-13(11)16/h5,10,14,19H,3-4,6-9H2,1-2H3
charge 0 multiplicity 1
42 atoms
O  3.90363 0.115699 1.85691
O  3.971646 0.927273 -0.302458
O  -4.266698 -1.479643 1.044333
C  -0.019906 -0.452079 -1.324343
C  1.260616 0.322438 -0.830383
C  1.900326 -0.230614 0.498145
C  0.280309 -1.977614 -1.345663
C  2.115444 -1.78594 0.385549
C  0.818711 -2.522027 -0.008934
C  1.002957 1.85502 -0.780131
C  -1.251426 -0.06692 -0.482914
C  -0.32826 -0.016831 -2.795131
C  -1.4205 1.366776 -0.167095
C  1.104433 0.097533 1.791724
C  -0.380666 2.243024 -0.315575
C  3.31998 0.353439 0.601365
C  -2.22729 -0.970667 -0.109939
C  -2.807474 1.815712 0.271045
C  -3.441715 0.816942 1.266619
C  -3.385317 -0.617537 0.733576
H  2.029666 0.150087 -1.610289
H  1.045516 -2.153126 -2.130044
H  -0.61698 -2.539181 -1.667694
H  2.507839 -2.161113 1.34823
H  2.886381 -1.991022 -0.385836
H  0.057431 -2.42189 0.786736
H  1.032995 -3.603763 -0.104771
H  1.166227 2.287198 -1.790651
H  1.765851 2.351516 -0.149689
H  -0.610342 1.047154 -2.864637
H  0.558171 -0.186077 -3.43491
H  -1.164656 -0.615867 -3.199137
H  0.113657 -0.383791 1.771508
H  1.654874 -0.266961 2.674198
H  0.947447 1.18299 1.909628
H  -0.55139 3.309115 -0.105749
H  -2.764425 2.827907 0.71286
H  -3.463534 1.88035 -0.62211
H  -2.167485 -2.027698 -0.388598
H  -4.492587 1.069192 1.491051
H  -2.887328 0.839282 2.227776
H  4.837573 0.461016 1.843731
