program: Gaussian 09
title: 000271767
version: EM64L-G09RevD.01
frameworkgroup: C1[X(C19H24O3)]
method: RPBEPBE
basis: SDD
operation: Freq
keyword: #pfreq=noraman
keyword: PBEPBE/SDD
title: #p freq=noraman PBEPBE/SDD
converged: YES YES NO NO
title: Mulliken charges:
elementType: O O O C C C C C C C C C C C C C C C C C C C H H H H H H H H H H H H H H H H H H H H H H H H
charge: -0.287631 -0.221952 -0.268004 0.130345 -0.220126 0.236718 -0.475895 -0.459867 -0.425601 0.361484 -0.754618 -0.259423 -0.757975 0.160184 0.381769 -0.441816 -0.571402 -0.467623 0.308413 -0.394625 -0.503409 -0.536292 0.238542 0.204494 0.198722 0.222948 0.209297 0.197441 0.229009 0.245922 0.219704 0.208609 0.224820 0.224227 0.233955 0.246352 0.229335 0.261835 0.234902 0.241054 0.229785 0.240483 0.240458 0.220961 0.220474 0.244015
chargesum: 0.00000
title: Mulliken charges with hydrogens summed into heavy atoms:
elementType: O O O C C C C C C C C C C C C C C C C C C C
charge: -0.287631 -0.221952 -0.268004 0.130345 0.018417 0.236718 -0.072678 -0.027622 0.000849 0.361484 -0.080383 -0.034604 -0.053442 0.160184 0.381769 -0.212481 -0.309567 -0.232720 0.308413 -0.153571 0.207317 0.149158
polarizability: 2.94556653e+02 4.29114980e+00 1.93882027e+02 -2.29015012e+01 1.95550229e+00 1.59123763e+02
1716.lowfreq: -18.6088 -11.2635 -0.0010 -0.0007 0.0005 2.4250 31.1561 36.6431 56.0243
frequency: 30.8560 36.5085 55.9837 86.1441 88.9579 100.3827 103.2999 157.0670 168.7883 178.0237 197.5064 207.5107 219.5138 241.7813 249.7293 253.5415 269.9900 275.9832 299.0007 305.3593 317.8655 332.3413 347.8410 381.7600 393.4576 412.6373 437.1080 445.5053 473.0753 499.2295 522.3100 534.3813 540.3421 569.0236 624.6652 664.1419 665.2339 684.9860 697.1652 713.5026 771.2800 783.4138 801.8021 823.5239 824.6162 838.6249 861.1668 867.4178 889.8852 898.7411 930.1963 936.2779 946.9032 949.8260 971.3238 977.5842 1004.5607 1007.6171 1026.0767 1031.5379 1060.2301 1073.0667 1084.9988 1098.1456 1112.6971 1113.5886 1135.8698 1141.1350 1148.6866 1154.5327 1161.7745 1167.8504 1176.8594 1200.1272 1207.7635 1218.9128 1238.2154 1245.6071 1268.5025 1287.1864 1310.7554 1325.4292 1333.3818 1339.7512 1349.9424 1368.2179 1382.8405 1394.3612 1397.5741 1422.1231 1425.8355 1439.6327 1450.6654 1460.9545 1464.4455 1466.2598 1466.3224 1468.0555 1472.7929 1473.9578 1476.5893 1483.6349 1487.6880 1491.8045 1565.1633 1618.7236 1627.3683 1642.6663 2958.2874 2969.2838 2974.6274 2980.5702 2991.3865 2992.7634 3001.6414 3008.9393 3027.8148 3036.3766 3045.6511 3053.1738 3066.7419 3093.4079 3100.2428 3100.2673 3102.0449 3119.8112 3121.0309 3123.9219 3129.5498 3144.3187 3161.1786 3163.1876
redmass: 5.5188 4.6941 4.0397 3.7515 3.2639 1.2937 2.5717 2.9641 3.6699 2.8957 2.9483 1.3936 1.8310 1.2817 1.4608 2.3718 3.1267 2.7607 2.9311 3.1441 2.7427 2.8168 4.8035 3.8743 3.4404 3.5108 3.1674 3.3010 3.0565 3.1844 3.0544 4.2950 3.6638 3.1065 3.9596 5.0088 3.5810 4.0822 3.5279 3.3895 3.4408 1.8831 2.9924 2.9489 1.6846 3.0850 2.1192 2.2904 2.1449 1.7673 2.2340 1.3733 3.2775 3.0838 1.3229 1.6328 4.5653 1.7446 2.5713 2.2006 2.7279 1.8400 2.4092 1.8709 1.2601 1.2649 1.5866 1.5703 2.5943 1.7345 1.3481 1.4010 1.9657 2.2664 1.9640 1.8965 2.1971 1.9122 1.4249 1.6717 1.5284 1.4656 1.4249 1.3980 1.4372 3.5928 1.2467 1.9825 1.2060 1.1722 2.3770 1.4049 1.0503 1.0756 1.0816 1.0527 1.0504 1.0553 1.0750 1.0725 1.0870 1.1354 1.0865 2.4367 6.6245 6.6469 9.7213 6.9658 1.0329 1.0569 1.0429 1.0594 1.0794 1.0651 1.0295 1.0375 1.0958 1.1021 1.1039 1.1020 1.0990 1.0988 1.0850 1.0973 1.1042 1.0995 1.0900 1.0989 1.0988 1.1047 1.0910 1.0933
irintensity: 1.1459 0.5520 0.2380 0.0655 2.5103 1.6384 3.2493 2.4714 1.2124 2.7596 1.3921 1.4227 2.6922 0.6836 0.0945 2.0065 3.2404 2.6530 2.1667 1.2657 3.5966 2.6958 9.7049 0.2653 2.8925 0.3694 0.2321 6.0932 1.9208 3.9547 4.3515 6.1831 11.5855 3.5822 1.9055 5.4936 15.2830 3.8238 7.7444 6.9884 1.4124 1.9031 1.3670 3.7341 63.4239 1.4123 8.6972 19.7697 13.4357 7.9407 2.3857 1.8634 6.9635 5.2775 1.8481 15.7993 62.6417 24.7813 46.8607 2.4864 3.8228 48.6460 157.3161 37.4834 0.1500 0.2852 10.9238 28.1963 14.8688 3.1012 7.3682 5.0115 42.7490 102.8656 17.8340 35.4161 79.6353 11.5319 17.7331 38.3362 1.4572 2.8308 3.7531 1.5530 3.3866 2.2896 12.6046 22.6555 21.1412 15.0251 41.9095 4.6775 12.8588 3.3570 8.9885 10.2386 14.8420 14.3463 10.5711 29.3608 9.3073 29.5761 5.3237 48.5431 56.3982 109.7272 168.0345 2.9656 89.1166 5.2295 57.9946 21.4117 19.0422 40.0487 44.9041 15.0346 34.1500 27.2809 47.6196 50.7554 37.3324 18.4862 1.3890 23.0161 28.4731 9.7509 20.0155 19.1870 41.0966 16.1900 9.2356 14.7318
temp: 298.150 k
press: 1.00000 atm
elementType: 8 8 8 6 6 6 6 6 6 6 6 6 6 6 6 6 6 6 6 6 6 6 1 1 1 1 1 1 1 1 1 1 1 1 1 1 1 1 1 1 1 1 1 1 1 1
symmnumber: 1
zpe: 1012601.7 jmol-1
zpe.correction: 0.385680 hartree
zpe.thermalcorrener: 0.407042 hartree
zpe.thermalcorrenthalpy: 0.407987 hartree
zpe.thermalcorrgfe: 0.336545 hartree
zpe.sumelectzpe: -962.428729 hartree
zpe.sumelectthermal: -962.407366 hartree
zpe.sumelectthermalent: -962.406422 hartree
zpe.sumelectthermalfe: -962.477864 hartree
dipole: 1.0552 0.3809 1.0894
dipole: 1.5637
quadrupole: -105.0980 -127.8661 -137.2549
quadrupole: -8.5836 -13.0634 -2.7834
quadrupole: 18.3083 -4.4597 -13.8486 -8.5836 -13.0634 -2.7834
hfenergy: -962.8144083 hartree
pointgroup: C01 [X(C19H24O3)]
dipole: -0.4205598 -0.1641303 0.4179406 debye
polarizability: 293.7010327|4.6098342|194.0304921|25.1972267|-0.8108779|159.8309177 unknown
InChI: InChI=1S/C19H24O3/c1-18-10-5-11-19(2,17(20)22-4)16(18)9-7-13-6-8-14(21-3)12-15(13)18/h6-9,12,16H,5,10-11H2,1-4H3
charge 0 multiplicity 1
46 atoms
O  4.157518 -0.125093 0.283482
O  3.791915 1.115246 -1.641821
O  -4.59303 -0.975335 -0.677032
C  0.025226 -0.721678 1.13867
C  1.334747 0.063986 0.764677
C  1.922413 -0.245073 -0.689218
C  0.198365 -2.229521 0.796974
C  2.037849 -1.796918 -0.876846
C  0.688223 -2.503886 -0.638197
C  -1.221276 -0.058656 0.514791
C  -0.169326 -0.624474 2.68952
C  1.154768 1.559447 0.958296
C  1.101755 0.373544 -1.846878
C  3.345868 0.339815 -0.766255
C  -1.263068 1.377271 0.463249
C  -0.064588 2.153865 0.809763
C  -2.358209 -0.78459 0.122139
C  -2.452021 2.020429 0.046446
C  -3.537174 -0.122734 -0.311323
C  -3.5960 1.290198 -0.343905
C  5.560898 0.348477 0.263031
C  -5.842301 -0.350899 -1.116516
H  2.113721 -0.295027 1.466915
H  -0.741122 -2.775464 1.004629
H  0.949286 -2.642357 1.502244
H  2.785656 -2.193858 -0.163673
H  2.409959 -2.005991 -1.898854
H  0.817012 -3.593917 -0.784537
H  -0.064601 -2.172694 -1.377942
H  -0.306291 0.419154 3.018694
H  -1.059931 -1.203735 2.994789
H  0.713024 -1.039993 3.212812
H  2.046763 2.164776 1.165285
H  1.589967 0.150754 -2.811653
H  0.076746 -0.027432 -1.867908
H  1.040098 1.468857 -1.751555
H  -0.168818 3.242574 0.905558
H  -2.378891 -1.877667 0.144785
H  -2.479587 3.116554 0.012344
H  -4.49795 1.81848 -0.666054
H  6.024645 -0.105466 1.150301
H  5.596193 1.449899 0.31377
H  6.062508 0.017304 -0.662051
H  -5.687673 0.264781 -2.024112
H  -6.283173 0.274793 -0.315961
H  -6.517289 -1.188248 -1.34687
