program: Gaussian 09
title: 000271737
version: EM64L-G09RevD.01
frameworkgroup: C1[X(C5H11O3P)]
method: RPBEPBE
basis: SDD
operation: Freq
keyword: #p
keyword: freq=noraman
keyword: PBEPBE/SDD
title: #p freq=noraman PBEPBE/SDD
converged: YES YES NO NO
title: Mulliken charges:
elementType: P O O O C C C C C H H H H H H H H H H H
charge: 1.038228 -0.557087 -0.498293 -0.521549 0.326070 -0.395562 -0.703092 -0.696036 -0.501857 0.237035 0.232116 0.246344 0.232603 0.202522 0.234707 0.204491 0.239042 0.242442 0.211404 0.226475
chargesum: 0.00000
title: Mulliken charges with hydrogens summed into heavy atoms:
elementType: P O O O C C C C C
charge: 1.038228 -0.557087 -0.498293 -0.521549 0.326070 0.073589 -0.021622 -0.017798 0.178463
polarizability: 1.10631841e+02 1.93463717e+00 7.55600533e+01 -2.20194634e+00 1.28903480e+00 7.25146548e+01
1716.lowfreq: -12.6740 -12.4382 -0.0011 0.0013 0.0013 3.5680 43.7924 59.3238 95.3479
frequency: 43.6439 59.2665 95.3421 144.5049 179.7601 204.8745 244.5179 260.7041 287.1086 321.3495 338.6830 383.1629 423.2401 525.9234 554.7086 589.7044 600.2862 662.0707 759.7543 837.9210 913.3602 923.5916 935.2579 975.0030 978.5514 1016.8614 1107.6376 1129.4984 1132.3913 1171.6168 1236.9919 1263.4461 1325.0141 1377.6233 1393.4879 1429.5777 1447.9197 1457.2646 1460.5161 1465.5961 1470.7263 1473.6141 1484.8885 2957.3498 2985.8357 2990.4003 3013.6720 3049.7475 3082.5668 3087.9084 3099.3240 3103.4452 3105.2406 3109.3196
redmass: 3.6107 3.0735 1.0640 3.7355 4.5503 1.0570 1.0641 3.4378 3.1066 4.0874 2.8802 2.5411 3.1529 6.8663 5.8423 8.7880 9.8687 7.3156 6.5802 3.4211 2.4501 3.1752 1.4734 7.4023 1.5730 1.4439 1.2462 1.3285 1.6132 1.5099 2.4157 2.5657 1.3161 1.2431 1.2116 1.1186 1.0652 1.0742 1.0533 1.0555 1.0581 1.0515 1.0504 1.0328 1.0360 1.0366 1.0608 1.1021 1.0987 1.0984 1.1018 1.1012 1.1027 1.1018
irintensity: 3.2638 4.6311 0.5723 7.3981 1.5560 0.1038 0.0927 1.9125 2.3739 9.7393 4.8136 3.5022 6.3748 16.1422 20.8063 77.5236 89.7399 17.8746 108.7905 82.1415 36.5937 63.4407 2.3673 131.5938 3.1481 0.9759 0.6919 8.5234 27.8805 21.6260 4.1794 30.9926 6.7372 34.0853 15.7763 1.2972 3.1247 8.5354 14.2399 6.6750 5.0458 11.2067 14.0630 94.4432 16.3470 21.8604 35.3016 46.9232 11.4723 32.2619 5.0958 25.2543 19.9659 30.1829
temp: 298.150 k
press: 1.00000 atm
elementType: 15 8 8 8 6 6 6 6 6 1 1 1 1 1 1 1 1 1 1 1
symmnumber: 1
zpe: 416729.7 jmol-1
zpe.correction: 0.158724 hartree
zpe.thermalcorrener: 0.170003 hartree
zpe.thermalcorrenthalpy: 0.170947 hartree
zpe.thermalcorrgfe: 0.121554 hartree
zpe.sumelectzpe: -763.291972 hartree
zpe.sumelectthermal: -763.280694 hartree
zpe.sumelectthermalent: -763.279749 hartree
zpe.sumelectthermalfe: -763.329142 hartree
dipole: -0.1305 0.3310 1.1488
dipole: 1.2026
quadrupole: -49.0167 -65.3579 -63.0267
quadrupole: -0.3808 -2.1010 3.0982
quadrupole: 10.1171 -6.2241 -3.8929 -0.3808 -2.1010 3.0982
hfenergy: -763.4506963 hartree
pointgroup: C01 [X(C5H11O3P1)]
dipole: -0.0321101 0.3010355 -0.3636063 debye
dipolederiv: 1.7875387 -0.1010658 0.0673184 -0.1866122 0.8586274 -0.1063426 -0.2272832 -0.0909604 0.9143144 -1.2608301 -0.1090837 -0.1810694 0.0829317 -0.4627765 0.1084676 -0.4508367 -0.053576 -0.5727353 -0.8373028 0.0951666 -0.1637419 0.1147617 -0.6029249 -0.0043998 -0.2775584 0.2206652 -0.6134317 -1.4061752 0.0237342 0.1232012 0.05555 -0.4166043 0.0483693 0.6960223 -0.0236478 -0.579881 0.8195118 0.0082419 0.0667301 -0.353534 0.1427964 -0.0639978 0.1573224 0.0760936 0.4050214 0.3060558 -0.0534583 0.0456702 0.098236 0.0781678 0.0729621 0.1343387 -0.1225527 0.3667 -0.057592 -0.0217627 0.0083843 0.0204267 0.045222 -0.0831169 -0.0189101 -0.0719958 -0.09936 -0.125848 -0.0013299 0.0820464 0.0178772 0.0223713 -0.0050258 0.0773854 -0.0412779 -0.084524 0.9361048 0.0328112 -0.0974728 0.1789083 0.2797645 -0.0550446 0.0889154 -0.0440464 0.2075541 -0.028651 -0.0262348 0.0944471 -0.0237685 0.0773308 -0.028658 0.0166181 0.0423184 -0.1244006 -0.0178898 0.1268953 -0.0405815 0.1038236 0.005317 0.0152565 -0.0377948 0.0094768 0.066377 -0.0455282 0.029101 0.1172334 0.0031578 0.0961996 -0.0170213 0.0913517 -0.0183322 0.0187115 0.0583234 -0.0929823 0.0020467 -0.1136664 -0.0762372 -0.0030965 0.02184 0.0566751 0.0733818 -0.0188752 0.0719698 -0.1009564 0.094772 0.0028242 0.0751258 -0.1126394 0.0268101 0.0061427 0.0945562 -0.0329712 -0.0556101 -0.0056946 0.032096 -0.1067381 -0.0115784 -0.0894456 -0.0651509 -0.0944904 0.0608668 -0.0680905 0.1022533 0.0542167 0.0565053 -0.0972267 0.0686116 0.0262188 0.0704815 -0.0370992 0.0298581 -0.0912468 -0.087779 0.062288 0.0351073 0.034398 0.0836832 -0.0710618 0.0390414 0.0891495 0.0504545 0.049496 -0.0838567 0.1205904 -0.0844122 -0.0021829 -0.0515311 0.0026688 -0.0394975 -0.0083592 0.0644369 0.0643136 -0.1931833 0.0731148 -0.1104301 -0.0567966 -0.014509 0.0209349 -0.140271 -0.1625446 0.0540098 -0.0124809 0.0320834 0.0839917 unknown
polarizability: 110.5977143|-1.1293302|72.0714375|2.826871|0.7879068|76.0373974 unknown
InChI: InChI=1S/C5H11O3P/c1-5(2)4-7-9(6-3)8-5/h4H2,1-3H3
charge 0 multiplicity 1
20 atoms
P  0.91499 -0.439544 1.277353
O  -0.415857 -1.372401 0.6096
O  0.119589 1.105986 0.864064
O  1.981109 -0.677811 -0.129827
C  -1.444598 -0.516735 -0.107858
C  -0.756825 0.865418 -0.313941
C  -1.743151 -1.22002 -1.437876
C  -2.669203 -0.425487 0.818952
C  3.398228 -0.297412 0.006756
H  -0.139488 0.865505 -1.231297
H  -1.479888 1.695781 -0.327106
H  -0.809694 -1.377763 -2.003631
H  -2.20854 -2.202916 -1.253183
H  -2.439207 -0.615909 -2.049713
H  -2.431632 0.161845 1.723503
H  -3.519537 0.053789 0.299031
H  -2.97585 -1.438107 1.130811
H  3.937037 -0.84985 -0.779109
H  3.812731 -0.57688 0.996507
H  3.529583 0.78961 -0.149233
