program: Gaussian 09
title: 000271743
version: EM64L-G09RevD.01
frameworkgroup: C1[X(C14H15OP)]
method: RPBEPBE
basis: SDD
operation: Freq
keyword: #p
keyword: freq=noraman
keyword: PBEPBE/SDD
title: #p freq=noraman PBEPBE/SDD
converged: YES YES NO NO
title: Mulliken charges:
elementType: P O C C C C C C C C C C C C C C H H H H H H H H H H H H H H H
charge: 1.022017 -0.664460 -0.862650 -0.113695 -0.878268 0.516923 -0.276574 -0.301866 -0.344826 -0.417779 -0.230038 -0.206379 -0.231874 -0.220756 -0.225082 -0.241558 0.240522 0.274254 0.261841 0.276591 0.231501 0.226967 0.294794 0.274345 0.221658 0.231286 0.234559 0.226592 0.223167 0.232130 0.226657
chargesum: 0.00000
title: Mulliken charges with hydrogens summed into heavy atoms:
elementType: P O C C C C C C C C C C C C C C
charge: 1.022017 -0.664460 -0.347874 -0.113695 -0.108334 0.516923 -0.049607 -0.007073 -0.070481 -0.196120 0.001249 0.028180 -0.005282 0.002411 0.007048 -0.014901
polarizability: 1.66573673e+02 1.43170661e+00 1.79592834e+02 -2.05389997e+01 1.66512904e+00 1.56288922e+02
1716.lowfreq: -8.4693 -0.0013 0.0004 0.0007 7.9741 15.8832 22.5362 27.5296 42.7155
frequency: 22.5032 27.2690 42.5823 89.7084 95.2543 109.3556 129.3136 173.5653 199.5329 221.5370 230.6938 309.5892 327.9278 343.5737 387.9508 398.0833 403.5263 469.6786 494.3159 563.9687 611.0808 614.4408 637.7553 667.1570 694.1441 699.9641 707.5844 762.6719 764.3358 807.3416 845.5156 851.0233 863.3137 897.2581 913.5433 934.1169 939.3216 971.3733 983.4941 987.7235 988.9589 992.2720 994.5879 1009.4737 1020.8437 1027.9926 1072.6167 1081.9865 1091.8998 1142.9453 1172.5598 1173.8653 1187.3313 1192.9199 1207.6960 1231.2650 1307.9387 1321.5314 1330.4311 1380.2977 1383.0200 1424.2292 1426.0473 1433.6783 1442.4681 1443.5148 1466.2310 1484.3184 1588.9673 1592.0858 1597.6086 1614.0389 3001.1652 3006.6001 3070.8673 3111.1762 3115.1636 3123.4044 3126.5914 3128.6584 3132.5445 3137.8951 3139.2845 3149.7651 3151.4186 3164.3936 3165.0533
redmass: 5.5000 3.8023 3.7397 3.6160 4.1239 1.0770 4.1757 3.5507 4.8196 5.4519 4.2703 2.5190 5.2974 4.3410 4.8424 2.8008 2.8022 3.6461 3.5131 5.0564 6.2862 6.0180 4.3046 5.3103 5.8570 1.7724 1.8423 1.7008 1.8355 4.2889 1.3813 1.4500 1.2649 1.7174 1.3707 1.4263 1.4600 1.4334 4.4362 1.3981 3.8884 4.5465 1.4876 1.3303 2.8022 2.2174 1.5817 1.6355 2.6668 1.1449 1.0519 1.0562 1.1243 1.1390 1.4717 2.1741 1.3120 1.1807 1.2695 8.7486 8.2759 1.1490 2.0188 1.0983 1.4827 1.2822 2.0548 2.3048 6.1039 6.0411 5.8725 6.0284 1.0578 1.0323 1.1033 1.0879 1.0868 1.1012 1.0869 1.0865 1.1017 1.0913 1.0923 1.0960 1.0960 1.1014 1.1014
irintensity: 0.3841 0.1627 0.0169 4.1744 1.6765 0.0254 6.0909 2.6137 2.9478 6.4226 4.5419 3.5769 2.3567 17.1220 23.3907 0.0858 0.1330 26.2713 37.8737 9.5666 0.0920 0.5936 1.7559 31.1641 17.7803 58.6180 73.8707 25.0089 48.5208 9.2125 5.5908 3.7634 0.9170 10.6657 9.4045 40.0173 48.6880 2.9947 28.2512 0.1573 0.1714 32.2077 1.8703 0.1447 0.8272 7.5343 14.8474 3.9833 46.7262 6.9417 0.1087 0.2095 1.5525 0.4247 0.7682 6.2280 2.4664 21.5441 0.5849 1.0621 0.1728 4.4064 18.6000 12.3602 24.1399 0.7371 6.5660 24.0224 0.4683 1.6543 0.3078 8.0251 12.5505 12.2512 5.0894 7.7826 8.3491 9.4207 1.5242 1.6133 4.5901 5.9585 29.1827 21.0017 20.9251 21.4764 30.9964
temp: 298.150 k
press: 1.00000 atm
elementType: 15 8 6 6 6 6 6 6 6 6 6 6 6 6 6 6 1 1 1 1 1 1 1 1 1 1 1 1 1 1 1
symmnumber: 1
zpe: 650425.7 jmol-1
zpe.correction: 0.247734 hartree
zpe.thermalcorrener: 0.263257 hartree
zpe.thermalcorrenthalpy: 0.264201 hartree
zpe.thermalcorrgfe: 0.202942 hartree
zpe.sumelectzpe: -957.783020 hartree
zpe.sumelectthermal: -957.767497 hartree
zpe.sumelectthermalent: -957.766553 hartree
zpe.sumelectthermalfe: -957.827812 hartree
dipole: 1.7481 -1.5425 -3.8020
dipole: 4.4599
quadrupole: -97.7846 -95.9930 -99.9836
quadrupole: -0.4276 -5.1312 -8.6232
quadrupole: 0.1358 1.9274 -2.0632 -0.4276 -5.1312 -8.6232
hfenergy: -958.030754 hartree
pointgroup: C01 [X(C14H15O1P1)]
dipole: -0.724609 -0.6102116 1.4769716 debye
polarizability: 166.0274164|0.672815|179.6820071|-20.6896357|1.200685|156.7460062 unknown
InChI: InChI=1S/C14H15OP/c1-16(15,14-10-6-3-7-11-14)12-13-8-4-2-5-9-13/h2-11H,12H2,1H3
charge 0 multiplicity 1
31 atoms
P  -0.544029 1.839558 -0.031596
O  -0.056982 2.276442 -1.513675
C  0.89816 1.431538 1.155142
C  -1.64057 0.323401 -0.06967
C  -1.525183 3.171424 0.862656
C  1.817542 0.361788 0.605494
C  -2.241333 -0.215205 1.092108
C  -1.847695 -0.281223 -1.330609
C  2.562135 0.5992 -0.58156
C  1.945052 -0.890555 1.25808
C  -3.057342 -1.364814 0.99035
C  -2.663613 -1.430985 -1.42825
C  3.426184 -0.394424 -1.090498
C  2.811728 -1.883939 0.747991
C  -3.267947 -1.972657 -0.26994
C  3.557859 -1.637136 -0.427144
H  0.461029 1.140071 2.126537
H  1.426598 2.39459 1.287467
H  -0.888236 4.063668 0.977793
H  -2.399654 3.428349 0.244229
H  -1.862605 2.822529 1.852729
H  -2.084293 0.248549 2.074582
H  -1.366176 0.159703 -2.211524
H  2.437104 1.54932 -1.112196
H  1.367315 -1.088161 2.169767
H  -3.525727 -1.784524 1.887507
H  -2.825867 -1.903275 -2.403268
H  3.993093 -0.201342 -2.008272
H  2.904038 -2.845384 1.265893
H  -3.900188 -2.864414 -0.347316
H  4.231506 -2.405392 -0.823311
