program: Gaussian 09
title: 000271734
version: EM64L-G09RevD.01
frameworkgroup: C1[X(C5H11O4P)]
method: RPBEPBE
basis: SDD
operation: Freq
keyword: #p
keyword: freq=noraman
keyword: PBEPBE/SDD
title: #p freq=noraman PBEPBE/SDD
converged: YES YES NO NO
title: Mulliken charges:
elementType: P O O O O C C C C C H H H H H H H H H H H
charge: 1.373624 -0.472110 -0.477850 -0.498574 -0.588613 -0.060688 -0.062342 -0.678045 -0.675010 -0.485318 0.239696 0.242272 0.252831 0.242893 0.210657 0.242822 0.248120 0.212479 0.235137 0.255422 0.242598
chargesum: 0.00000
title: Mulliken charges with hydrogens summed into heavy atoms:
elementType: P O O O O C C C C C
charge: 1.373624 -0.472110 -0.477850 -0.498574 -0.588613 0.179007 0.179931 0.028336 0.028410 0.247839
polarizability: 1.09507748e+02 1.95448369e+00 8.63224554e+01 -6.09864080e-01 -2.92331386e+00 6.94102593e+01
1716.lowfreq: -0.0008 0.0011 0.0020 10.4492 13.6172 16.2032 55.0923 58.8712 72.6089
frequency: 54.9200 58.8128 72.5564 99.2504 159.8526 192.5954 218.3271 229.9423 241.9066 281.4035 294.5353 316.5810 359.1189 413.5404 486.9770 540.3393 595.3475 622.3636 697.1148 705.5765 763.1088 827.2234 862.0163 962.5193 999.4095 1003.2975 1047.9674 1065.8475 1101.1578 1113.0678 1114.2917 1135.9306 1150.8024 1252.3365 1281.3336 1298.9708 1344.3398 1394.7700 1395.9719 1426.3562 1458.7991 1460.2515 1464.4544 1472.7618 1473.4235 1475.1766 2988.4725 2988.7270 2994.0860 3057.8110 3060.0713 3084.4886 3088.1210 3100.1514 3105.1599 3106.8479 3133.2924
redmass: 1.4905 1.8764 3.0735 4.0170 5.1025 5.1268 1.3428 1.0572 1.8721 5.6485 4.6623 5.7101 4.3888 4.0201 4.3426 4.8284 10.8588 5.7156 5.7257 7.8837 2.5932 3.3530 3.2361 9.4298 1.4314 1.6878 2.4148 12.9123 2.3216 1.2366 1.5919 1.3136 2.3286 1.4048 1.2843 1.2096 1.5144 1.2218 1.2242 1.1186 1.0528 1.0441 1.0531 1.0470 1.0512 1.0478 1.0368 1.0369 1.0289 1.0886 1.0887 1.0982 1.0973 1.1058 1.1002 1.0998 1.1045
irintensity: 3.8146 3.0589 5.2233 1.1048 2.0621 7.4767 0.0877 0.0518 0.4675 12.3772 4.8214 17.5723 1.4345 21.2059 4.8520 20.8492 19.7415 53.8057 69.1540 139.2397 55.8441 14.1586 146.2428 232.6646 19.7099 39.6813 28.2247 121.7291 11.8018 0.6497 28.0720 0.5036 7.0346 0.6582 1.6752 2.0641 17.3321 35.8737 15.8244 2.9423 13.5735 23.2464 1.4604 13.7998 10.6187 10.4078 14.1899 11.2861 49.1351 8.3707 6.8718 3.8811 52.5569 22.8346 1.4781 29.9206 11.9731
temp: 298.150 k
press: 1.00000 atm
elementType: 15 8 8 8 8 6 6 6 6 6 1 1 1 1 1 1 1 1 1 1 1
symmnumber: 1
zpe: 428824.6 jmol-1
zpe.correction: 0.163331 hartree
zpe.thermalcorrener: 0.175571 hartree
zpe.thermalcorrenthalpy: 0.176515 hartree
zpe.thermalcorrgfe: 0.124756 hartree
zpe.sumelectzpe: -838.412351 hartree
zpe.sumelectthermal: -838.400111 hartree
zpe.sumelectthermalent: -838.399167 hartree
zpe.sumelectthermalfe: -838.450926 hartree
dipole: 2.1869 2.9374 -0.6873
dipole: 3.7260
quadrupole: -50.6339 -71.6050 -73.2041
quadrupole: -3.6169 1.0981 2.1056
quadrupole: 14.5138 -6.4573 -8.0564 -3.6169 1.0981 2.1056
hfenergy: -838.5756818 hartree
pointgroup: C01 [X(C5H11O4P1)]
dipole: -1.0572348 0.5089117 0.8787403 debye
dipolederiv: 2.637957 -0.0090426 0.0849384 0.0115819 1.455433 0.2681856 0.3368574 0.1818496 1.5012734 -1.1279235 0.2314802 0.1745826 0.1240389 -0.6478488 -0.0792142 0.1956649 -0.1306599 -0.5563252 -1.2195607 -0.1881988 -0.1042289 -0.0088662 -0.5916828 -0.0619404 -0.0190848 -0.0248453 -0.4770126 -1.3352432 -0.1433083 -0.2876155 -0.1457352 -0.4953755 -0.1270177 -0.434206 -0.1358919 -0.6990666 -0.7868567 0.0110491 0.04275 -0.0074651 -0.5374754 -0.0548901 -0.0287853 -0.0527996 -0.6414982 0.5669883 -0.1935245 -0.1628723 0.0690211 0.1954935 0.0625837 -0.3422418 0.1677773 0.4153934 0.7333689 0.1671043 0.1399314 -0.1289383 0.1769624 0.050048 0.2866576 0.0797234 0.3183218 -0.0209393 0.0144745 0.0057003 -0.0189357 -0.0313353 -0.1033624 0.057612 -0.0872157 -0.1750003 -0.063252 -0.0357547 -0.0761507 -0.0097732 -0.0294835 -0.0983507 -0.1085029 -0.0725719 -0.1374053 0.7902702 0.1629283 0.2510606 0.1527075 0.2939583 0.024743 -0.0479963 -0.0203873 0.1538449 -0.0912628 0.0631387 -0.0507186 0.0591248 0.0689606 0.0256136 -0.0421558 0.0179483 -0.035607 -0.0791405 -0.0354716 0.0489785 -0.0222735 0.0852727 0.024046 0.0524067 0.0203161 -0.0663714 0.0351764 0.0474673 -0.0893561 0.0675429 0.0488908 0.0615102 -0.0589708 0.0272483 0.03976 0.1088645 -0.0586961 -0.0067665 -0.0310591 -0.1153221 -0.0249949 0.0000063 0.0111569 0.071878 -0.1217153 -0.0109935 0.0942061 -0.036521 0.0944341 0.0019438 0.0871563 -0.0237622 0.0521025 0.0389755 -0.0419687 0.1008373 -0.0507378 0.0648993 0.0702876 0.0595699 0.0337757 -0.0044294 0.1163158 0.0205431 -0.0058548 -0.0149382 -0.1164563 -0.0284633 -0.0104607 0.0025024 0.0768838 -0.1390149 0.0401203 -0.0409418 0.071993 0.0824185 -0.0025393 -0.0354507 -0.0217241 0.0824568 -0.030607 -0.0351444 -0.0397224 -0.101718 -0.1343511 0.0237737 0.0259419 0.062165 0.0959989 0.0035077 0.0100939 0.005699 0.0468157 0.0294865 -0.0713719 0.1266279 -0.0764993 0.0528179 -0.0159083 -0.0162965 -0.0844567 -0.0258642 0.103121 0.0394097 -0.1006457 0.0418942 -0.0680153 unknown
polarizability: 109.5026009|0.7832356|74.3356504|1.9326798|8.2203012|81.4022111 unknown
InChI: InChI=1S/C5H11O4P/c1-4-5(2)9-10(6,7-3)8-4/h4-5H,1-3H3
charge 0 multiplicity 1
21 atoms
P  0.737697 -0.54223 -0.26958
O  -0.389532 0.76597 -0.586672
O  -0.479777 -1.62747 0.35899
O  1.575509 -0.183269 1.194458
O  1.676907 -0.949025 -1.477591
C  -1.707546 0.47229 0.071744
C  -1.849396 -1.086042 0.064275
C  -1.749723 1.093765 1.469802
C  -2.368088 -1.657253 -1.257325
C  3.037223 0.076216 1.133104
H  -2.450489 0.929419 -0.603873
H  -2.458084 -1.421157 0.921037
H  -1.024995 0.602806 2.143156
H  -1.501796 2.166899 1.414875
H  -2.762113 0.992495 1.904278
H  -1.789837 -1.268423 -2.114687
H  -2.286318 -2.756819 -1.253119
H  -3.430987 -1.387163 -1.401676
H  3.219629 1.137275 0.890479
H  3.522162 -0.572889 0.383698
H  3.403452 -0.155495 2.144127
