program: Gaussian 09
title: 000271731
version: EM64L-G09RevD.01
frameworkgroup: C1[X(C7H15O3P)]
method: RPBEPBE
basis: SDD
operation: Freq
keyword: #p
keyword: freq=noraman
keyword: PBEPBE/SDD
title: #p freq=noraman PBEPBE/SDD
converged: YES YES NO NO
title: Mulliken charges:
elementType: P O O O C C C C C C C H H H H H H H H H H H H H H H
charge: 1.017067 -0.544884 -0.511412 -0.517731 0.308736 -0.103453 -0.709565 -0.718878 -0.697891 -0.257641 -0.638627 0.228766 0.206778 0.235221 0.237679 0.231718 0.249935 0.202295 0.229253 0.207858 0.261000 0.227574 0.193418 0.206568 0.225496 0.230724
chargesum: 0.00000
title: Mulliken charges with hydrogens summed into heavy atoms:
elementType: P O O O C C C C C C C
charge: 1.017067 -0.544884 -0.511412 -0.517731 0.308736 0.125313 -0.029888 -0.034929 0.000220 0.163350 0.024160
polarizability: 1.39283410e+02 -2.40478089e+00 9.74214791e+01 2.74515543e+00 3.39836557e-01 9.02656483e+01
1716.lowfreq: -24.1251 -11.8431 -5.9135 -0.0001 0.0009 0.0014 31.4258 37.4087 66.3458
frequency: 31.2579 36.0607 66.2679 116.3104 161.9239 203.0877 218.2211 222.3786 244.5644 249.0189 274.6130 278.3243 317.6674 336.7381 353.5812 399.8105 424.1056 487.2133 526.7828 581.8955 598.1928 605.3477 667.2085 734.0073 796.6662 801.6030 842.2852 869.8873 926.0606 936.9245 991.1535 1019.7413 1026.3067 1050.7312 1090.2526 1119.3917 1142.4403 1148.8417 1205.2421 1240.0969 1266.9213 1271.6622 1331.2525 1350.2702 1377.7542 1388.8142 1388.9503 1395.9350 1449.8582 1457.3818 1458.4838 1466.5009 1468.8785 1471.9675 1479.3585 1484.1033 1490.2615 2961.9543 2984.1404 2985.1047 2988.9638 2994.7555 3037.2234 3055.3888 3081.2654 3081.4080 3084.3302 3089.6411 3098.4962 3100.2204 3105.0914 3113.6769
redmass: 3.7467 2.7875 2.8286 3.7956 3.0401 1.7590 1.6290 1.2242 1.1112 2.6015 1.4711 1.6537 3.1977 2.9324 3.0661 3.1420 3.6265 3.4386 6.7613 5.2793 6.6506 7.7776 5.7484 3.4548 3.3698 1.1492 3.9825 3.0029 1.7922 1.6419 1.3387 2.8708 1.6304 1.7594 2.1266 2.4403 1.5629 2.1220 2.3062 2.3332 1.1214 1.6203 1.4143 1.2280 1.2348 1.2307 1.2288 1.2095 1.0465 1.0476 1.0422 1.0637 1.0476 1.0627 1.0531 1.0574 1.0499 1.0651 1.0367 1.0359 1.0363 1.0368 1.0869 1.0982 1.0992 1.0981 1.0983 1.0986 1.1017 1.0999 1.1007 1.1000
irintensity: 2.4103 0.4526 2.2552 2.5450 0.4413 0.1257 0.0891 0.3911 0.0940 1.4292 0.7443 1.8682 1.7775 9.0565 3.4728 4.7671 10.6595 1.5769 14.2512 36.2150 34.5002 133.3081 24.7153 61.6633 41.4821 1.9146 211.1258 28.7468 1.4272 3.4642 6.0309 144.2786 32.7018 19.6303 13.1309 17.2558 9.1437 57.2927 7.5965 4.2825 1.1941 7.5318 8.9948 21.8115 26.4171 42.3449 14.1329 16.4639 4.7101 11.1519 23.0578 2.0839 6.6966 0.3537 13.1008 5.6759 12.9232 69.5031 24.4543 16.3844 16.3023 25.8000 22.4535 9.9478 24.1235 56.3760 19.5591 23.8040 38.1214 15.8685 23.1124 21.4849
temp: 298.150 k
press: 1.00000 atm
elementType: 15 8 8 8 6 6 6 6 6 6 6 1 1 1 1 1 1 1 1 1 1 1 1 1 1 1
symmnumber: 1
zpe: 562856.3 jmol-1
zpe.correction: 0.214381 hartree
zpe.thermalcorrener: 0.228223 hartree
zpe.thermalcorrenthalpy: 0.229168 hartree
zpe.thermalcorrgfe: 0.173723 hartree
zpe.sumelectzpe: -841.749406 hartree
zpe.sumelectthermal: -841.735563 hartree
zpe.sumelectthermalent: -841.734619 hartree
zpe.sumelectthermalfe: -841.790064 hartree
dipole: -0.1339 0.8773 -0.2557
dipole: 0.9235
quadrupole: -61.3409 -73.6884 -79.9929
quadrupole: -3.5791 1.1451 1.2748
quadrupole: 10.3331 -2.0143 -8.3188 -3.5791 1.1451 1.2748
hfenergy: -841.9637866 hartree
pointgroup: C01[X(C7H15O3P1)]
dipole: -0.1431305 0.2594002 0.2103526 debye
dipolederiv: 1.9418727 0.107557 -0.0126726 -0.0214493 0.8069319 0.1812904 0.2694378 0.1771378 0.8814653 -1.2861904 -0.2990669 0.0741387 -0.0829374 -0.5253718 -0.0965149 0.3462529 0.0766767 -0.4729585 -0.9805666 0.0951841 0.1922928 0.0785944 -0.568239 -0.0162817 0.3553869 -0.2049517 -0.6854373 -1.5530905 -0.230842 -0.1551751 -0.1578691 -0.4565995 -0.0827853 -0.703598 -0.1398805 -0.5890293 0.8805728 0.211255 0.0050392 -0.1998902 0.1078892 0.0464181 0.0002001 -0.0297879 0.3299969 0.3992174 -0.0668603 -0.0630488 0.1700331 0.1781552 -0.0178567 -0.2353149 0.1664847 0.4903464 -0.0892299 -0.0361783 -0.0823515 -0.0091864 0.0101307 -0.0388812 -0.1018294 0.0069177 -0.1378718 -0.0528249 -0.0614612 0.004876 -0.0207839 0.0312651 0.0755835 0.0095483 0.056119 -0.0899082 -0.0580904 -0.0051116 -0.0932547 -0.0466652 -0.0092968 -0.0762726 -0.0188069 -0.0568155 -0.1708498 1.092852 0.1814888 0.1189406 0.3108944 0.411326 0.053081 -0.1215028 0.0152757 0.2579452 -0.0603056 -0.0401872 -0.0287618 -0.100763 -0.1798211 -0.0523185 0.01485 -0.0449086 0.0376281 -0.1204159 0.0941852 -0.020667 0.0884884 0.0428489 0.0257747 -0.0099307 0.0047574 -0.0016971 -0.1578921 0.0294018 0.0324182 0.0701538 0.0807741 -0.0231114 0.0681662 -0.0363721 0.0652925 0.0858524 -0.0367331 0.0750639 -0.0168166 0.0269857 0.1132644 0.0374896 0.0815072 -0.0430861 0.0957889 0.0115672 -0.0161108 -0.0374458 -0.111632 -0.0829166 -0.0221735 -0.0439449 0.0666453 0.0950151 -0.0378385 0.0004689 -0.0735716 -0.1179337 -0.0251668 -0.0088377 -0.0872031 0.0728448 0.0093384 0.0049995 -0.1139777 -0.0096823 0.1175455 -0.0097255 -0.0949268 -0.0050737 -0.0474655 -0.1052911 0.0519423 0.0826094 0.0931621 0.0433186 -0.026525 0.0880748 0.0164041 0.0507871 0.0878689 -0.0727198 -0.0275309 -0.0619321 -0.1264059 -0.0369652 -0.0181333 0.0107644 0.0737139 -0.053921 -0.0220758 0.1352239 -0.0326842 0.1057348 0.0328336 0.1338882 0.0003345 -0.045808 0.0293157 0.0595677 -0.0629203 0.081144 0.0366153 0.0332523 -0.0394028 0.0048852 0.0816541 -0.1286189 0.0349694 -0.0739429 0.0442518 -0.0432141 0.0619013 -0.102806 0.0852756 0.0237102 -0.0297982 -0.0154164 0.0176596 -0.0384793 0.0168542 -0.0557272 0.1714229 -0.07122 -0.1411707 -0.1999054 -0.0903805 0.012355 -0.1054979 0.0577828 -0.0162798 0.0184689 -0.0052898 0.1097109 0.0510241 0.0993663 -0.085819 0.0656148 0.0028961 0.0509282 -0.09314 0.0787501 -0.0047406 0.1074224 0.0333873 0.0851468 0.0133175 0.0614598 -0.016999 0.0572162 -0.0558424 -0.1117176 unknown
polarizability: 137.0721164|10.567227|94.817403|-0.3668446|3.3512756|95.0810177 unknown
InChI: InChI=1S/C7H15O3P/c1-5-8-11-9-6(2)7(3,4)10-11/h6H,5H2,1-4H3
charge 0 multiplicity 1
26 atoms
P  0.763438 -0.512686 -1.102226
O  -0.348144 -1.69033 -0.392513
O  -0.374225 0.82538 -0.793326
O  1.865602 -0.508491 0.293237
C  -1.680529 -1.0828 -0.02166
C  -1.3884 0.436419 0.242331
C  -2.629564 -1.25503 -1.225226
C  -2.160484 -1.866855 1.205982
C  -0.876686 0.803372 1.640885
C  3.271174 -0.090189 0.068704
C  3.468462 1.38776 0.426355
H  -2.279829 1.034789 -0.018422
H  -3.663891 -0.975316 -0.951565
H  -2.309957 -0.623558 -2.073303
H  -2.627567 -2.308799 -1.551662
H  -2.322883 -2.922333 0.928682
H  -1.410381 -1.834334 2.01169
H  -3.11482 -1.455808 1.5841
H  -0.590343 1.869301 1.649535
H  -1.66422 0.652266 2.401917
H  0.010852 0.20678 1.910832
H  3.869614 -0.744088 0.726628
H  3.570475 -0.285977 -0.982981
H  4.536994 1.664428 0.345588
H  2.885332 2.042366 -0.245554
H  3.137881 1.57673 1.462374
