program: Gaussian 09
title: 000271727
version: EM64L-G09RevD.01
frameworkgroup: C1[X(C7H15O4P)]
method: RPBEPBE
basis: SDD
operation: Freq
keyword: #p
keyword: freq=noraman
keyword: PBEPBE/SDD
title: #p freq=noraman PBEPBE/SDD
converged: YES YES NO NO
title: Mulliken charges:
elementType: P O O O O C C C C C C C H H H H H H H H H H H H H H H
charge: 1.399563 -0.474197 -0.480455 -0.521098 -0.597721 0.231451 -0.344973 -0.340923 -0.714418 -0.671772 -0.258029 -0.648001 0.234647 0.225659 0.230586 0.234949 0.224494 0.224953 0.215250 0.253546 0.207888 0.207619 0.227746 0.240744 0.218048 0.251242 0.223200
chargesum: 0.00000
title: Mulliken charges with hydrogens summed into heavy atoms:
elementType: P O O O O C C C C C C C
charge: 1.399563 -0.474197 -0.480455 -0.521098 -0.597721 0.231451 0.115333 0.124612 -0.049721 -0.002719 0.210461 0.044489
polarizability: 1.33556150e+02 -3.81903867e+00 1.01964774e+02 1.19630574e+00 -2.23437393e+00 9.27179299e+01
1716.lowfreq: -29.3326 -8.1074 -0.0019 -0.0011 0.0005 8.6073 14.6888 48.2027 56.6196
frequency: -25.9720 48.0149 56.5693 116.2629 144.7229 147.4100 178.4029 201.9520 225.1764 230.9530 250.9729 270.8080 292.4680 323.7485 361.0208 381.8350 395.9892 399.4081 445.8275 457.8136 545.3533 597.8056 671.6395 682.8718 763.9073 798.3301 857.7923 887.6477 906.9305 917.4678 934.2863 939.9910 955.5488 1014.4051 1016.9996 1025.5547 1083.4100 1091.3548 1142.1982 1165.7323 1184.4305 1188.2809 1268.6447 1274.3337 1302.8465 1323.9961 1350.5801 1352.7210 1380.7466 1391.8930 1401.0764 1444.6413 1455.4379 1460.7152 1463.4982 1463.8304 1472.3921 1477.9254 1479.6578 1484.6805 2973.3603 2984.0991 2987.5006 2988.5996 2997.1684 3017.6868 3067.9496 3073.2874 3076.9805 3080.3697 3086.2527 3086.4133 3090.7159 3098.8440 3110.0119
redmass: 2.9165 2.9925 3.5148 3.0648 1.2340 2.2130 2.3459 1.0657 5.9470 1.6157 2.7400 3.0721 4.8316 4.4700 4.8839 2.5922 2.3599 2.9335 4.4911 4.1636 6.4952 5.5603 9.1254 8.4167 3.7548 1.1173 3.4611 3.0026 2.2708 2.6166 1.5173 1.4140 5.9361 2.8913 1.4013 1.8535 12.5963 2.1878 1.5562 1.7803 1.2312 1.9261 1.1160 2.3390 1.9269 1.1853 1.2461 1.2585 1.1961 1.2266 1.1962 1.0809 1.0687 1.0437 1.0470 1.0679 1.0752 1.0609 1.0557 1.0615 1.0360 1.0383 1.0361 1.0607 1.0617 1.0610 1.0995 1.1002 1.1002 1.1015 1.1004 1.1004 1.1042 1.0987 1.1053
irintensity: 2.1673 0.8358 1.0685 0.4480 1.7862 4.7018 1.9224 0.2099 0.8540 1.8174 2.5892 3.8839 3.6813 18.3336 30.6240 1.2187 8.4801 7.8308 7.1592 11.9545 2.2663 26.3584 137.3034 168.5959 3.3866 3.4828 164.6332 25.2180 2.0181 0.7496 3.6210 23.7041 247.5695 140.3980 0.8060 28.7609 152.9750 7.6361 10.5951 0.0122 0.1585 0.8650 0.2094 0.4940 1.7008 1.9387 10.6081 4.3757 23.6785 28.7258 19.9494 5.1206 0.1913 13.9965 0.3368 4.6941 15.4066 11.5810 13.3326 24.4796 20.2369 33.6921 10.9213 26.6467 44.1144 31.7993 24.9867 0.8679 24.5512 14.1858 48.0000 15.6667 23.7273 19.5331 30.9417
temp: 298.150 k
press: 1.00000 atm
elementType: 15 8 8 8 8 6 6 6 6 6 6 6 1 1 1 1 1 1 1 1 1 1 1 1 1 1 1
symmnumber: 1
zpe: 575823.4 jmol-1
zpe.correction: 0.219320 hartree
zpe.thermalcorrener: 0.233091 hartree
zpe.thermalcorrenthalpy: 0.234035 hartree
zpe.thermalcorrgfe: 0.179469 hartree
zpe.sumelectzpe: -916.858766 hartree
zpe.sumelectthermal: -916.844995 hartree
zpe.sumelectthermalent: -916.844050 hartree
zpe.sumelectthermalfe: -916.898617 hartree
dipole: 2.3332 -4.9519 1.2542
dipole: 5.6159
quadrupole: -67.2541 -87.3005 -83.0683
quadrupole: 5.3390 -2.0209 1.6396
quadrupole: 11.9535 -8.0929 -3.8606 5.3390 -2.0209 1.6396
hfenergy: -917.0780853 hartree
pointgroup: C01 [X(C7H15O4P1)]
dipole: -0.8657243 2.0012836 -0.3565587 debye
polarizability: 133.3127314|-4.871348|102.2955247|0.0254082|-2.0179671|92.6305976 unknown
InChI: InChI=1S/C7H15O4P/c1-4-9-12(8)10-5-7(2,3)6-11-12/h4-6H2,1-3H3
charge 0 multiplicity 1
27 atoms
P  0.884724 -0.656058 0.476587
O  0.038384 -0.42637 -1.025354
O  -0.388939 -0.597069 1.64149
O  1.668253 0.865522 0.768663
O  1.796152 -1.942553 0.51275
C  -2.068677 0.475262 0.067134
C  -0.984576 0.66541 -1.027672
C  -1.39203 0.500188 1.464233
C  -3.037086 1.683508 -0.009861
C  -2.834218 -0.852169 -0.145985
C  3.146685 0.946266 0.54833
C  3.502012 1.002741 -0.939324
H  -1.42279 0.605937 -2.037627
H  -0.465284 1.636813 -0.902622
H  -0.88682 1.46992 1.64281
H  -2.123671 0.309097 2.266314
H  -3.544109 1.714118 -0.991645
H  -3.819469 1.604859 0.766966
H  -2.509224 2.645735 0.132855
H  -2.156301 -1.719922 -0.085492
H  -3.619426 -0.975382 0.622613
H  -3.320963 -0.865868 -1.138617
H  3.420736 1.875356 1.074465
H  3.62782 0.084613 1.046805
H  4.593265 1.142988 -1.0543
H  3.223708 0.065275 -1.452193
H  2.989944 1.844484 -1.436623
