program: Gaussian 09
title: 000271774
version: EM64L-G09RevD.01
frameworkgroup: C1[X(C19H26O4)]
method: RPBEPBE
basis: SDD
operation: Freq
keyword: #pfreq=noraman
keyword: PBEPBE/SDD
title: #p freq=noraman PBEPBE/SDD
converged: NO YES NO NO
title: Mulliken charges:
elementType: O O O O C C C C C C C C C C C C C C C C C C C H H H H H H H H H H H H H H H H H H H H H H H H H H
charge: -0.441838 -0.281242 -0.224228 -0.268716 -0.184587 0.210071 0.257943 -0.475384 -0.566503 -0.461421 -0.451377 0.372794 -0.302076 -0.790472 0.237213 -0.785200 0.126235 -0.533094 -0.395019 0.287441 -0.399651 -0.506078 -0.535439 0.227388 0.217375 0.215868 0.223573 0.249222 0.225889 0.199909 0.239964 0.200560 0.241163 0.219480 0.253742 0.222833 0.226228 0.245225 0.226912 0.253070 0.247472 0.330769 0.244009 0.231210 0.243955 0.239419 0.220428 0.220640 0.244323
chargesum: 0.00000
title: Mulliken charges with hydrogens summed into heavy atoms:
elementType: O O O O C C C C C C C C C C C C C C C C C C C
charge: -0.111069 -0.281242 -0.224228 -0.268716 0.042800 0.210071 0.257943 -0.042141 -0.093709 -0.035623 -0.010853 0.372794 -0.060913 -0.094417 0.237213 -0.086834 0.126235 -0.280024 -0.147547 0.287441 -0.155642 0.208506 0.149952
polarizability: 2.69279522e+02 7.33680683e+00 2.06118877e+02 -6.60754814e+00 5.71013299e-01 1.67617408e+02
1716.lowfreq: -10.2062 -3.1147 0.0004 0.0004 0.0007 11.4506 35.1984 55.6255 70.8462
frequency: 34.9739 55.6091 70.8419 77.5158 82.7450 94.6869 109.3710 119.2314 145.4569 146.8737 176.7573 187.9341 208.1074 217.1825 220.3733 231.8232 249.5782 254.8678 264.2075 281.5709 288.8306 295.6117 307.8162 317.2649 336.3652 353.2192 368.7308 396.0434 407.3122 437.4142 452.2312 461.7306 501.3415 509.7875 537.4356 542.5176 606.0897 620.3621 624.3090 672.8833 684.6380 703.1905 728.3648 749.8835 775.0275 786.4260 811.5549 818.8485 848.3385 852.9825 871.2750 883.1666 901.2472 911.3264 941.4638 943.0424 963.2689 973.3938 985.2093 994.9562 1007.0436 1018.1348 1045.4474 1053.6213 1073.4303 1085.2818 1100.6579 1107.6253 1111.9265 1113.5874 1115.9301 1140.3425 1146.8730 1153.3688 1170.0897 1180.8541 1188.0468 1204.3641 1208.1592 1215.0459 1232.5411 1237.0136 1247.1382 1270.6204 1284.0168 1303.9712 1311.8549 1334.1693 1335.1635 1344.1705 1351.4735 1359.9683 1369.0385 1385.1699 1387.9709 1396.4335 1415.0210 1421.0243 1436.2464 1448.9505 1451.8652 1455.6255 1460.6804 1464.0227 1466.0684 1471.5398 1473.8213 1479.6461 1484.8042 1487.4615 1489.9080 1498.5842 1574.4275 1617.7083 1620.8668 2957.9361 2970.3808 2975.1089 2979.0410 2984.4201 2994.8784 2998.0588 3000.0220 3001.4837 3030.0976 3032.6658 3044.9428 3045.2704 3058.0374 3072.7295 3080.5385 3087.3907 3098.5883 3101.3867 3102.4433 3123.0819 3126.6816 3145.8680 3157.5437 3164.1559 3550.1065
redmass: 4.2201 4.1917 3.8086 4.1328 2.3625 3.4504 1.5528 3.4073 3.3957 3.7270 2.4666 1.7947 1.7952 1.5186 1.9509 1.6586 2.5603 1.8985 2.5811 1.9308 2.4397 2.2784 2.9877 2.9773 3.2730 3.7982 2.6122 3.3802 3.2698 3.4781 3.0113 3.1994 3.1281 3.5930 3.9080 3.4195 3.9011 3.2630 3.9585 3.8143 3.4874 5.0771 5.9140 3.6367 3.2731 2.9158 1.5944 2.4672 1.9629 2.9720 2.5629 2.0157 1.9669 2.3317 2.9542 1.5440 2.0183 1.8118 1.8197 2.4615 3.8174 2.6389 1.7960 2.6678 2.3392 1.8855 2.9287 2.2686 1.2623 1.3392 1.8900 1.5797 1.4378 1.5803 1.7403 1.7105 2.1459 1.8911 1.6206 1.9706 1.4133 2.7729 1.7634 2.0159 1.3186 1.6728 1.3476 1.4845 1.4227 1.4393 1.4563 1.1454 1.5929 4.1772 1.2739 1.1977 3.2783 1.1767 1.1830 1.0898 1.0503 1.0870 1.0685 1.0549 1.0503 1.0608 1.0708 1.0880 1.0837 1.1521 1.8353 1.1742 7.1681 9.4495 6.7552 1.0330 1.0794 1.0632 1.0615 1.0378 1.0582 1.0434 1.0636 1.0301 1.0987 1.0860 1.0973 1.1039 1.1009 1.0990 1.0955 1.0980 1.1012 1.0970 1.1033 1.0987 1.0895 1.1048 1.0898 1.0945 1.0661
irintensity: 0.8809 0.2035 1.0306 2.9125 0.9528 5.4094 0.1249 1.0657 0.2970 1.9584 4.4705 51.7115 24.0608 37.4207 16.3613 4.9811 0.9619 5.0356 21.5384 1.9534 5.7050 1.3892 2.6216 3.0809 1.9320 7.3815 0.2504 2.8742 2.6397 1.4775 1.9279 5.4093 2.6334 6.3827 11.4669 12.7153 7.3302 0.7836 0.5280 2.5868 0.9268 15.0589 13.7158 1.5720 5.2970 29.8097 20.7544 3.7788 5.6946 36.2204 6.0673 11.5599 10.0337 10.9099 8.4411 0.6741 12.0066 10.7625 23.5822 35.1351 50.8537 15.7492 60.1538 18.3568 31.0764 21.1629 8.1223 101.6492 0.1237 13.6715 13.5521 6.7823 14.4785 12.9674 95.2236 12.5417 20.2051 22.6371 19.4349 14.6997 16.2338 70.6483 10.4232 98.0902 4.2520 13.3287 1.1590 3.4129 2.0693 3.6188 0.9723 36.1780 16.3234 8.1935 21.0115 16.8115 4.8926 13.5211 3.8767 12.0782 11.1031 6.2079 2.7864 6.4083 12.9939 18.1368 52.9780 11.1295 25.5963 31.0753 33.9061 27.2279 43.8852 134.3843 117.2054 79.0442 15.1665 25.4849 10.9817 31.4457 34.0906 21.4698 38.5746 30.2463 25.6244 39.3640 27.9675 51.1085 36.6715 37.8580 19.6997 29.6472 19.6064 21.4423 39.8598 29.6941 4.7733 13.9965 6.0059 16.0234 5.3360
temp: 298.150 k
press: 1.00000 atm
elementType: 8 8 8 8 6 6 6 6 6 6 6 6 6 6 6 6 6 6 6 6 6 6 6 1 1 1 1 1 1 1 1 1 1 1 1 1 1 1 1 1 1 1 1 1 1 1 1 1 1
symmnumber: 1
zpe: 1083136.5 jmol-1
zpe.correction: 0.412545 hartree
zpe.thermalcorrener: 0.435694 hartree
zpe.thermalcorrenthalpy: 0.436638 hartree
zpe.thermalcorrgfe: 0.361978 hartree
zpe.sumelectzpe: -1038.749483 hartree
zpe.sumelectthermal: -1038.726335 hartree
zpe.sumelectthermalent: -1038.725390 hartree
zpe.sumelectthermalfe: -1038.800050 hartree
dipole: -1.7985 -0.2466 0.6672
dipole: 1.9340
quadrupole: -118.9268 -149.7427 -130.3377
quadrupole: 4.6168 3.9404 -7.2803
quadrupole: 14.0756 -16.7403 2.6647 4.6168 3.9404 -7.2803
hfenergy: -1039.1620284 hartree
pointgroup: C01 [X(C19H26O4)]
dipole: 0.7065929 -0.0416088 -0.2792144 debye
polarizability: 269.2165211|-5.8439663|204.7379957|-8.3076417|7.2262414|169.0612901 unknown
InChI: InChI=1S/C19H26O4/c1-18-8-5-9-19(2,17(21)23-4)16(18)11-15(20)13-7-6-12(22-3)10-14(13)18/h6-7,10,15-16,20H,5,8-9,11H2,1-4H3
charge 0 multiplicity 1
49 atoms
O  0.360303 3.301551 -0.444638
O  -3.228142 0.197089 -1.733402
O  -4.015558 -1.58031 -0.468014
O  4.586723 -1.58615 -0.613262
C  -1.185734 0.655033 0.267663
C  -0.165974 -0.550183 0.194471
C  -2.659361 0.211927 0.631727
C  -0.272673 -1.425312 1.492376
C  -0.663081 1.752743 1.225389
C  -2.681844 -0.693268 1.893381
C  -1.712062 -1.891017 1.801579
C  1.297434 -0.036216 0.094758
C  0.637037 2.376306 0.696027
C  -0.467188 -1.425483 -1.060464
C  1.664136 1.324826 0.324331
C  -3.588695 1.448854 0.871516
C  -3.344147 -0.523345 -0.537566
C  2.329757 -0.957397 -0.204209
C  3.020064 1.714046 0.214913
C  3.680556 -0.556623 -0.305613
C  4.041161 0.798836 -0.104013
C  -3.923872 -0.388879 -2.902704
C  5.999354 -1.224837 -0.748226
H  -1.243624 1.10679 -0.744874
H  0.117087 -0.844727 2.352796
H  0.39657 -2.300669 1.384595
H  -0.482025 1.344003 2.238502
H  -1.393025 2.572784 1.322063
H  -3.712983 -1.054349 2.061839
H  -2.407222 -0.066518 2.765488
H  -2.072228 -2.598385 1.03215
H  -1.718812 -2.442901 2.761469
H  1.052148 3.067635 1.450954
H  0.253853 -2.255143 -1.154797
H  -1.466247 -1.887306 -1.015431
H  -0.409148 -0.819167 -1.982344
H  -3.361873 1.923717 1.841108
H  -3.477365 2.197739 0.068749
H  -4.646943 1.129374 0.903334
H  2.11826 -2.017686 -0.370037
H  3.273613 2.767899 0.381032
H  0.220823 2.753587 -1.25926
H  5.078349 1.137321 -0.181034
H  -3.760532 0.33082 -3.717161
H  -4.998326 -0.512861 -2.686999
H  -3.49062 -1.373423 -3.148954
H  6.403862 -0.814454 0.197662
H  6.152412 -0.492194 -1.56471
H  6.514005 -2.165476 -0.993659
