program: Gaussian 09
title: 000026095
version: EM64L-G09RevD.01
frameworkgroup: C1[X(C5H5BrN2)]
method: RPBEPBE
basis: SDD
operation: Freq
keyword: #p
keyword: freq=noraman
keyword: PBEPBE/SDD
title: #p freq=noraman PBEPBE/SDD
converged: NO NO NO NO
title: Mulliken charges:
elementType: Br N N C C C C C H H H H H
charge: -0.006643 -0.660856 -0.029595 0.577726 -0.319579 -0.310211 -0.305026 -0.305110 0.225605 0.253574 0.241631 0.323617 0.314866
chargesum: 0.00000
title: Mulliken charges with hydrogens summed into heavy atoms:
elementType: Br N N C C C C C
charge: -0.006643 -0.022373 -0.029595 0.577726 -0.319579 -0.084606 -0.051452 -0.063479
polarizability: 1.20662039e+02 -4.01228218e+00 9.00910376e+01 -1.00504153e-04 3.35488277e-03 3.19641000e+01
1716.lowfreq: -0.0003 0.0003 0.0007 5.0161 5.9928 21.4362 136.4458 201.2833 241.9234
frequency: 136.4282 201.2831 241.9091 275.1157 404.9307 428.1685 434.6953 476.5296 528.2978 569.5975 677.1337 733.1244 823.6976 833.2002 904.7870 949.4642 966.9425 1030.4363 1064.5759 1178.4228 1289.9828 1319.7505 1342.0419 1404.2442 1465.2041 1529.2100 1584.4009 1632.1184 3126.5673 3138.8998 3151.2184 3541.6068 3689.1781
redmass: 4.2559 5.9964 5.0298 11.1238 2.1632 3.0298 1.3346 1.0968 8.3495 4.1917 7.4356 4.1592 1.4205 5.2048 1.3802 1.4343 5.8647 1.7603 1.8726 1.6565 1.6403 5.3561 1.8196 2.4607 2.7327 6.5936 3.6335 1.3703 1.0872 1.0920 1.0985 1.0456 1.1037
irintensity: 0.1209 3.2468 4.1613 3.6697 60.8354 0.9339 95.1348 158.4443 3.8354 1.7081 18.8849 4.9230 60.7943 18.4737 2.5932 0.0946 49.8052 62.2975 4.6227 10.7028 4.3516 21.9397 5.1989 11.0054 45.3498 0.4478 76.6430 291.2113 7.9028 17.1925 21.8244 64.3507 38.6954
temp: 298.150 k
press: 1.00000 atm
elementType: 35 7 7 6 6 6 6 6 1 1 1 1 1
symmnumber: 1
zpe: 245672.1 jmol-1
zpe.correction: 0.093572 hartree
zpe.thermalcorrener: 0.100706 hartree
zpe.thermalcorrenthalpy: 0.101650 hartree
zpe.thermalcorrgfe: 0.061107 hartree
zpe.sumelectzpe: -315.915774 hartree
zpe.sumelectthermal: -315.908639 hartree
zpe.sumelectthermalent: -315.907695 hartree
zpe.sumelectthermalfe: -315.948238 hartree
dipole: -0.1896 4.4379 0.0012
dipole: 4.4419
quadrupole: -54.3475 -49.0746 -59.9794
quadrupole: 7.0230 0.0006 0.0034
quadrupole: 0.1197 5.3926 -5.5122 7.0230 0.0006 0.0034
hfenergy: -316.0093453 hartree
pointgroup: C01 [X(C5H5Br1N2)]
dipole: 0.7192784 1.5927053 -0.0004745 debye
dipolederiv: -0.6972272 0.2301216 0.0000206 0.2063646 -0.1865722 0.000005 0.0000264 -0.0000085 -0.0327362 -0.7670721 -0.6470415 -0.0000511 -0.5791465 -0.7266745 -0.000135 -0.0001274 -0.0002966 -0.6935034 -0.6809281 0.0881863 0.0000007 -0.0617945 -0.5167076 0.0000249 0.000047 0.0000328 -0.2434243 0.5501063 0.9057282 0.0000367 0.672369 0.7086807 0.0000419 -0.000097 -0.0000123 0.1771688 0.9043635 -0.4923793 -0.0000439 -0.7067912 -0.2198523 0.0000105 -0.0000409 0.0000518 -0.1404333 -0.2952153 -0.4084489 0.0000069 0.034389 -0.0608063 -0.0000054 -0.0000058 0.0000131 -0.1874125 0.2000705 0.0568409 0.0000055 0.2463791 0.2659874 -0.0000157 0.0000499 -0.000038 -0.020937 0.3591615 0.0134312 0.0000042 -0.0747512 0.4278889 -0.0000399 0.000026 -0.0000404 -0.0741148 0.0572547 0.0112168 0.0000006 0.0382594 -0.1239576 0.0000195 -0.0000127 0.0000086 0.1780951 0.080698 0.0570624 -0.000001 0.0624932 -0.0609441 0.0000091 -0.0000269 0.0000171 0.1322491 -0.0909344 0.090992 -0.0000008 0.0779422 0.0574608 0.000006 -0.0000065 0.0000119 0.1429092 0.2177963 0.0383947 0.0000376 0.0221909 0.2365326 0.0000091 0.0001185 0.0000723 0.377818 0.1619263 0.0558958 -0.0000161 0.062096 0.1989642 0.0000699 0.0000496 0.0001882 0.3843214 unknown
polarizability: 119.1973976|-7.6634703|91.5556786|-0.0013423|-0.0030763|31.9641 unknown
InChI: InChI=1S/C5H5BrN2/c6-4-3-8-2-1-5(4)7/h1-3H,7H2
charge 0 multiplicity 1
13 atoms
Br 2.480952 -1.263025 -0.000057
N  1.485281 1.767985 -0.000053
N  -1.744697 -1.016239 0.000104
C  0.438279 0.865925 -0.000056
C  0.648291 -0.547577 0.000022
C  -0.924919 1.295875 -0.000081
C  -0.445207 -1.436493 0.000086
C  -1.955006 0.337765 0.000007
H  -1.160203 2.366407 -0.000135
H  -0.279596 -2.519762 0.00015
H  -3.004264 0.654362 -0.00001
H  2.44779 1.436338 -0.000239
H  1.304599 2.76794 -0.000438
