program: Gaussian 09
title: 000271724
version: EM64L-G09RevD.01
frameworkgroup: C1[X(C10H13O2P)]
method: RPBEPBE
basis: SDD
operation: Freq
keyword: #p
keyword: freq=noraman
keyword: PBEPBE/SDD
title: #p freq=noraman PBEPBE/SDD
converged: YES YES NO NO
title: Mulliken charges:
elementType: P O O C C C C C C C C C C H H H H H H H H H H H H H
charge: 0.864896 -0.513627 -0.483514 -0.001854 -0.353165 -0.347699 -0.693887 -0.202404 -0.322439 -0.178333 -0.212249 -0.221352 -0.222670 0.195253 0.188717 0.221867 0.235941 0.193180 0.199213 0.225401 0.236132 0.242290 0.260053 0.230436 0.229676 0.230138
chargesum: 0.00000
title: Mulliken charges with hydrogens summed into heavy atoms:
elementType: P O O C C C C C C C C C C
charge: 0.864896 -0.513627 -0.483514 0.193398 0.057419 0.081423 -0.033141 -0.202404 -0.080149 0.081720 0.018187 0.008324 0.007468
polarizability: 1.89172121e+02 5.83948417e+00 1.02714676e+02 -3.62022228e+00 1.22932854e+01 1.13868739e+02
1716.lowfreq: -19.9735 -10.1800 0.0018 0.0019 0.0024 3.6974 15.5099 61.2055 77.9063
frequency: 10.8601 61.1256 77.8860 141.6622 183.1865 206.9590 211.8680 250.6044 265.7867 296.2050 355.9695 384.7482 395.6773 443.0908 454.8283 474.7448 534.5619 585.2427 611.7192 646.6958 690.0939 694.7001 754.2524 792.4392 841.6514 850.4190 862.4829 924.9023 945.9013 965.8260 975.0547 987.6704 999.2384 1019.5184 1023.0050 1063.9956 1076.0842 1091.8142 1133.0749 1142.1276 1173.5721 1187.1604 1206.3732 1227.5444 1297.0936 1307.7844 1319.3915 1347.6202 1358.8795 1380.4570 1384.7311 1423.6430 1429.6610 1456.3858 1459.3237 1465.5189 1476.1401 1586.0030 1595.8607 2922.7435 2941.8949 2983.8096 2989.0238 3054.9693 3073.2909 3086.2534 3101.4453 3119.9824 3128.9157 3143.3717 3158.9132 3170.3575
redmass: 3.7487 4.3727 3.9942 4.0121 2.1955 1.3914 4.0016 5.6521 2.3094 2.8176 6.4084 6.2525 2.7451 2.9885 7.5708 3.2365 2.5024 9.1953 6.4249 6.1716 6.8062 1.8667 1.6857 2.8789 3.2494 1.2536 2.6665 1.3760 1.7856 1.3407 1.4087 6.2705 1.3271 2.9496 3.2621 2.4124 1.6551 2.6768 2.0882 1.9473 1.0554 1.1198 1.3361 1.1927 1.2731 1.3194 1.1961 1.3247 1.4642 8.8165 1.2443 2.0916 1.0928 1.0476 1.0873 2.0591 1.0494 6.0044 5.9267 1.0835 1.0683 1.0573 1.0395 1.0995 1.0968 1.0990 1.1001 1.0868 1.0877 1.0925 1.0971 1.0989
irintensity: 0.0346 1.3245 2.4568 1.8357 3.3681 1.1118 0.9238 0.1401 2.0999 1.4835 5.5735 4.0830 0.2554 12.6577 30.1576 3.8324 17.0434 70.3089 2.8154 34.6836 9.2253 51.7976 42.7337 42.1859 17.6342 0.1841 88.7988 0.6838 27.7359 11.7854 0.1867 1.4287 0.0057 1.9581 37.8566 125.8906 8.7691 23.9867 7.2296 14.4940 0.1000 4.5351 5.8651 5.3172 7.0459 3.7722 18.3500 14.7997 19.9755 1.7856 22.6053 16.2712 10.5299 11.3710 8.6605 4.1653 7.0770 0.4439 2.9349 37.9061 85.9602 20.8318 45.1136 34.2561 29.7306 39.5241 26.2011 1.8775 1.0129 23.3292 31.6551 16.8217
temp: 298.150 k
press: 1.00000 atm
elementType: 15 8 8 6 6 6 6 6 6 6 6 6 6 1 1 1 1 1 1 1 1 1 1 1 1 1
symmnumber: 1
zpe: 546608.4 jmol-1
zpe.correction: 0.208192 hartree
zpe.thermalcorrener: 0.220892 hartree
zpe.thermalcorrenthalpy: 0.221836 hartree
zpe.thermalcorrgfe: 0.167656 hartree
zpe.sumelectzpe: -879.559503 hartree
zpe.sumelectthermal: -879.546803 hartree
zpe.sumelectthermalent: -879.545859 hartree
zpe.sumelectthermalfe: -879.600040 hartree
dipole: -1.0929 0.2224 0.1214
dipole: 1.1219
quadrupole: -65.2158 -88.4585 -81.5309
quadrupole: 2.5405 -1.8916 5.0116
quadrupole: 13.1860 -10.0568 -3.1292 2.5405 -1.8916 5.0116
hfenergy: -879.7676955 hartree
pointgroup: C01 [X(C10H13O2P1)]
dipole: 0.4225499 -0.1192143 0.0453325 debye
dipolederiv: 1.3882787 0.066301 -0.0870186 -0.0719536 0.8776286 0.0598586 0.1256582 0.0826684 0.761007 -1.2457125 0.3336678 0.0275353 0.4042757 -0.7228689 -0.1245341 -0.2122321 0.0900569 -0.4482072 -1.0636628 -0.1399799 -0.2079972 -0.0181665 -0.5474795 -0.0180555 -0.3804835 -0.2495994 -0.6489013 0.9992931 -0.3135815 -0.0495292 0.0398798 0.2588833 0.0056078 0.0600984 0.0229007 0.3782493 -0.0660656 0.0706676 -0.038913 0.060201 -0.1442428 -0.087544 -0.0379669 -0.0700122 -0.0365467 0.8441433 0.1749102 0.2147896 -0.0483738 0.334362 -0.0359467 -0.0059872 -0.0952143 0.2360597 -0.0537063 0.1041371 0.0055182 0.0759292 -0.1123969 -0.0222589 -0.0211652 -0.0335675 0.0417843 -0.3644749 -0.0637507 0.0736485 -0.159868 -0.1598689 0.0585535 0.2176523 0.0705257 -0.1793414 0.0178794 0.0822969 -0.1012173 -0.1061862 -0.0720372 -0.1065668 0.1868843 -0.0887452 0.0127945 -0.0594097 -0.0741785 0.1201843 0.0577573 -0.0476825 -0.0141183 -0.0845345 -0.0310396 -0.0215139 -0.0094883 -0.0752158 0.1401368 -0.0627994 -0.1281785 -0.0394461 0.1140997 -0.0417069 -0.0689654 -0.1650901 0.0517729 -0.0777922 0.0051252 -0.0677377 -0.1392365 -0.0088288 -0.131203 0.045606 0.1171144 0.0439519 -0.0269851 0.0381954 -0.0869853 -0.0772834 -0.022054 -0.0770132 -0.0255085 -0.0859185 -0.0025815 0.0489133 -0.118388 -0.0474252 0.118847 0.068797 0.0636178 -0.1024212 -0.2290568 0.0094034 -0.0622194 0.0145426 0.0878998 0.0029501 -0.040279 0.0029698 0.0809692 0.0828615 -0.0589523 0.0913243 -0.0322344 -0.0258906 0.0800402 0.0443598 0.0535359 -0.0449958 -0.0230749 -0.0375163 -0.05741 -0.0071791 0.0139613 -0.0844596 -0.0948524 -0.1243174 -0.0816378 -0.095912 -0.0693928 0.026138 -0.0259312 -0.0282075 0.06895 0.1512636 0.1709061 -0.0382932 -0.1926356 0.0498793 -0.0172202 0.0123613 0.0593541 -0.007489 -0.0415447 0.007322 0.102394 0.0713429 -0.0709204 0.0822656 -0.0198244 0.0302534 0.0552979 0.0677607 0.1077261 -0.038322 0.1132353 -0.0416807 -0.0588016 -0.0061456 0.0279912 -0.0755083 -0.0254243 -0.110034 -0.0836828 0.1179005 -0.0367264 0.0493714 -0.0100874 0.0757148 0.1033904 0.0129008 0.0995618 -0.007839 0.04868 0.0387624 -0.0779709 0.0396703 0.1103855 0.0402005 -0.0782102 0.0420265 0.0640625 -0.0744196 0.0393841 -0.0909822 0.0435101 0.1211448 0.0701092 -0.1016158 0.0697302 0.0413132 0.044948 -0.0254942 0.0255757 -0.0445395 0.0710312 0.1258761 0.0522466 0.1261464 -0.0345528 -0.1170493 -0.0551636 0.0486559 -0.059771 0.1223912 0.042766 0.0534571 0.0427585 0.0964893 unknown
polarizability: 189.447444|0.0912783|104.4340925|4.1160857|-13.2785566|111.8739985 unknown
InChI: InChI=1S/C10H13O2P/c1-9-7-8-11-13(12-9)10-5-3-2-4-6-10/h2-6,9H,7-8H2,1H3
charge 0 multiplicity 1
26 atoms
P  0.566186 0.933775 -0.765688
O  1.308729 -0.701813 -0.61244
O  1.099195 1.550499 0.847354
C  2.78975 -0.636411 -0.421017
C  3.114041 0.068947 0.919073
C  2.577547 1.516761 0.971331
C  3.278142 -2.084225 -0.484573
C  -1.15854 0.439271 -0.251173
C  -2.247077 0.858042 -1.053751
C  -1.387929 -0.335231 0.911738
C  -3.567997 0.502364 -0.69467
C  -2.707114 -0.688604 1.268485
C  -3.797146 -0.270997 0.466351
H  3.230763 -0.044732 -1.256776
H  4.213029 0.083543 1.06815
H  2.665002 -0.515301 1.74426
H  2.790048 1.991601 1.943634
H  3.041751 2.129395 0.166381
H  4.377526 -2.131357 -0.373935
H  2.815029 -2.676943 0.323874
H  2.997848 -2.539415 -1.449432
H  -2.068953 1.45857 -1.954403
H  -0.537238 -0.650672 1.52302
H  -4.409995 0.826763 -1.31593
H  -2.887329 -1.287312 2.168331
H  -4.820168 -0.547416 0.746302
